{"text_format":"1","workbook":"xlsx","n_sheets":6,"sheets":["Accueil","Scores","Pronostics","Data","Debug","Temp"],"not_rendered":{"charts":0,"images":13,"macros":1,"external_links":1,"defined_names":238,"comments":1,"pivot_tables":0},"unopened":[],"bounds":{"document_bytes":16777216,"sheet_cells":100000,"rows_first":2000,"rows_last":500,"rows_between":2000,"halvings":0,"cell_chars":16384,"cell_head_chars":4096},"cells_cut":0,"cells_raw":0,"read":"whole","date_system":"1900"}

{"sheet":"Accueil","index":0,"n_rows":42,"n_cols":6,"rows_kept":42,"cut":false,"hidden":false,"merged":[]}
[null,null,null,null,null,"Avec le seul tableau respectant le règlement jusqu'au tirage au sort !"]
[]
[]
[]
[]
[]
[]
["Les Scores"]
[]
["Inscrivez vos pronostics ou les résultats des matchs dans les tableaux ci-dessous."]
["Les calculs se feront automatiquement."]
["Et les équipes se positionneront dans le tableau final."]
[]
["Publiez vos pronostics et obtenez votre classement parmi tous les concurrents."]
[]
[]
[]
[]
[]
[]
[]
[]
[]
[]
["Les Pronostics"]
[]
["Récupérez les pronostics des autres utilisateurs pour suivre les tendances."]
[]
[]
[]
[]
[]
[]
[]
["Méthode de calcul du rang"]
[]
["Le calcul du rang se fait à partir de la dernière publication de vos pronostics."]
["Seuls les pronostics pour les matchs à venir sont pris en compte."]
[]
["Le nombre de matchs correctement pronostiqués détermine le rang. "]
["En cas d’égalité c’est le nombre total de matchs pronostiqués qui sera  déterminant. "]
["Si l’égalité persiste le joueur le plus ancien (date de première publication) sera privilégié."]

{"sheet":"Scores","index":1,"n_rows":36,"n_cols":93,"rows_kept":36,"cut":false,"hidden":false,"merged":[[26,24,27,25],[26,26,27,26],[10,18,11,18],[18,18,19,18],[18,19,19,19],[12,18,13,18],[12,19,13,19],[16,18,17,18],[16,19,17,19],[23,18,24,18],[23,19,24,19],[21,18,22,21],[21,22,22,22],[10,19,11,19],[30,18,30,23],[29,18,29,23],[1,31,1,38],[2,31,2,38],[1,13,1,20],[6,19,7,19],[8,18,9,18],[8,19,9,19],[6,18,7,18],[1,25,2,26],[6,27,6,28],[7,27,7,28],[8,27,8,28],[5,26,5,28],[26,18,27,19],[26,20,27,20]]}
[null,null,null,null,{"$f":"Data!T45","v":"Faites vos paris entre amis ! "},null,null,null,null,null,{"$f":"Data!T49","v":"Avec le seul tableau respectant le règlement jusqu'au tirage au sort !"}]
[null,null,null,null,{"$f":"Data!T46","v":"Inscrivez vos pronostics ou les résultats des matchs dans les tableaux ci-dessous."},null,null,null,null,null,null,null,null,null,null,null,null,null,null,null,null,null,null,null,null,{"$f":"Data!T50","v":"Si vous n'arrivez pas à lire correctement ce tableau  :"}]
[null,null,null,null,{"$f":"Data!T47","v":"Les calculs se feront automatiquement."}]
[null,null,null,null,{"$f":"Data!T48","v":"Et les équipes se positionneront dans le tableau final."},null,null,null,null,null,null,null,null,null,null,null,null,null,null,null,null,null,null,null,null,"-> Téléchargez gratuitement une version d'essai d'Office 2010"]
[null,null,null,null,null,null,null,null,null,null,null,null,null,null,null,null,null,null,null,null,null,null,null,null,null,"->Profitez des promos Office 2010 du moment !"]
[null,{"$f":"Data!T29","v":"Groupe A"},null,null,null,null,null,null,null,null,null,null,null,null,null,null,null,null,{"$f":"Data!T33","v":"Quarts de finale"},null,null,null,"Pen",null,null,null,{"$f":"Data!T41","v":"Statistiques"},null,null,null,null,null,null,null,null,"AJ","AK","AL","AM","AN","AO","AP","AQ","AR","AS","AT","AU","AV","AW","AX","AY","AZ","BA","BB","BC","BD","BE","BF","BG","BH","BI","BJ","BK","BL","BM","BN","BO","BP","BO","BP",null,{"$f":"IF($BL8,IF(E7-F7<0,-0.5,IF(F7-E7<0,0.5,0)),IF($BH8,IF($AY8>$AY9,-0.5,IF($AY8<$AY9,0.5,0)),IF($BI8,IF($AZ8>$AZ9,-0.5, IF($AZ8<$AZ9,0.5,0)),0)))","v":0},null,{"$f":"F11-E11","v":-1}]
[null,"2012-06-08","18:00:00",{"$f":"Data!T2","v":"Pologne"},1,1,{"$f":"Data!T3","v":"Grèce"},null,null,{"$f":"Data!T29","v":"Groupe A"},{"$f":"Data!T38","v":"Pts"},{"$f":"Data!T39","v":"BP"},{"$f":"Data!T40","v":"BC"},{"$f":"\"+/-\"","v":"+/-"},null,null,null,null,"2012-06-21","20:45:00",{"$f":"IF(OR(I9<2),Data!T27,T(J8))","v":"Rép.Tchèque"},null,null,null,null,null,{"$f":"Data!T42","v":"Succès"},{"$f":"IF(ISBLANK(Data!T21),0,Data!T21/100)","v":0.06},null,null,null,null,null,null,null,null,"Rank","Team","Pts","GF","GA","GD","Ag1","Ag2","Ag3","Ag4","Sp1","Sp2","Sp3","Sp4","T123","T124","T134","T234","Rk1","Rk2","Rk3","Rk4","T1234","T123","T124","T134","T234","T12","T13","T14","T23","T24","T34","NoT","sRk1","sRk2","sRk3","sRk4","T1x","T2x","T3x","T4x"," Règle d","T1x","T2x","T3x","T4x","T1234","T123","T124","T134","T234","TXXX?"]
[null,"2012-06-08","20:45:00",{"$f":"Data!T4","v":"Russie"},4,1,{"$f":"Data!T5","v":"Rép.Tchèque"},null,{"$f":"AH8","v":1},{"$f":"INDEX(AL8:AL11,MATCH(AJ8,$AK8:$AK11,0))","v":"Rép.Tchèque"},{"$f":"INDEX(AM8:AM11,MATCH(AJ8,$AK8:$AK11,0))","v":6},{"$f":"INDEX(AN8:AN11,MATCH(AJ8,$AK8:$AK11,0))","v":4},{"$f":"INDEX(AO8:AO11,MATCH(AJ8,$AK8:$AK11,0))","v":5},{"$f":"INDEX(AP8:AP11,MATCH(AJ8,$AK8:$AK11,0))","v":-1},null,null,null,null,null,null,{"$f":"IF(OR(I18<3,I17<2),Data!T27,T(J17))","v":"Portugal"},null,null,null,null,null,{"$f":"Data!T43","v":"Position"},{"$f":"IF(ISBLANK(Data!T22),\"\",Data!T22)","v":367},null,null,null,null,null,1,{"$f":"ROUND(AJ8,0)","v":1},{"$f":"MIN(AK8:AK11)","v":0.98},{"$f":"SUM(BC8:BF8)+2.45","v":3.95},{"$f":"D7","v":"Pologne"},{"$f":"SUM(AQ8:AT8)","v":2},{"$f":"E7+E9+F11","v":2},{"$f":"F7+F9+E11","v":3},{"$f":"AN8-AO8","v":-1},"x",{"$f":"IF(ISBLANK(E7),0,IF(E7>F7,3,IF(E7=F7,1,0)))","v":1},{"$f":"IF(ISBLANK(E9),0,IF(E9>F9,3,IF(E9=F9,1,0)))","v":1},{"$f":"IF(ISBLANK(F11),0,IF(F11>E11,3,IF(F11=E11,1,0)))","v":0},"x",{"$f":"(10*(AP8-AP9)+AN8-AN9>0)","v":false},{"$f":"10*(AP8-AP10)+AN8-AN10>0","v":false},{"$f":"10*(AP8-AP11)+AN8-AN11>0","v":false},{"$f":"10000*(AR8+AS8)+(E9-F9+E7-F7)*100+(E9+E7)","v":20002},{"$f":"10000*(AR8+AT8)+(E7-F7+F11-E11)*100+(E7+F11)","v":9901},{"$f":"10000*(AS8+AT8)+(E9-F9+F11-E11)*100+(E9+F11)","v":9901},"x","x",{"$f":"IF($AM8>$AM9,-0.5,IF($AM9>$AM8,0.5,IF(CK8=1,CC8,IF(BX8<>0,BX8,IF(AV8,-0.5,IF(AU9,0.5,BT8))))))","v":0.5},{"$f":"IF($AM8>$AM10,-0.5,IF($AM10>$AM8,0.5,IF(CK8=1,CD8,IF(BY8<>0,BY8,IF(AW8,-0.5,IF(AU10,0.5,BU8))))))","v":0.5},{"$f":"IF($AM8>$AM11,-0.5,IF($AM11>$AM8,0.5,IF(CK8=1,CE8,IF(BZ8<>0,BZ8,IF(AX8,-0.5,IF(AU11,0.5,BV8))))))","v":0.5},{"$f":"AND(AND(AM8=AM9,AM9=AM10,AM10=AM11),AND(AN8=AN9,AN9=AN10,AN10=AN11),AND(AO8=AO9,AO9=AO10,AO10=AO11))","v":false},{"$f":"AND(NOT(BG8),AM8=AM9,AM8=AM10,AN8=AN9,AN8=AN10,AO8=AO9,AO8=AO10)","v":false},{"$f":"AND(NOT(BG8),AM8=AM9,AM8=AM11,AN8=AN9,AN8=AN11,AO8=AO9,AO8=AO11)","v":false},{"$f":"AND(NOT(BG8),AM8=AM10,AM8=AM11,AN8=AN10,AN8=AN11,AO8=AO10,AO8=AO11)","v":false},{"$f":"AND(NOT(BG8),AM9=AM10,AM9=AM11,AN9=AN10,AN9=AN11,AO9=AO10,AO9=AO11)","v":false},{"$f":"AND(NOT(BG8),NOT(BH8),NOT(BI8),AM8=AM9,AN8=AN9,AO8=AO9)","v":false},{"$f":"AND(NOT(BG8),NOT(BH8),NOT(BJ8),AM8=AM10,AN8=AN10,AO8=AO10)","v":false},{"$f":"AND(NOT(BG8),NOT(BI8),NOT(BJ8),AM8=AM11,AN8=AN11,AO8=AO11)","v":false},{"$f":"AND(NOT(BG8),NOT(BH8),NOT(BK8),AM9=AM10,AN9=AN10)","v":false},{"$f":"AND(NOT(BG8),NOT(BI8),NOT(BK8),AM9=AM11,AN9=AN11,AO9=AO11)","v":false},{"$f":"AND(NOT(BG8),NOT(BJ8),NOT(BK8),AM10=AM11,AN10=AN11,AO10=AO11)","v":false},{"$f":"AND(NOT(BG8:BQ8))","v":true},"x",{"$f":"IF($BL8,IF(F7-E7<0,-0.5,IF(E7-F7<0,0.5,0)),IF($BH8,IF($AY8>$AY9,-0.5,IF($AY8<$AY9,0.5,0)),IF($BI8,IF($AZ8>$AZ9,-0.5, IF($AZ8<$AZ9,0.5,0)),0)))","v":0},{"$f":"IF($BM8,IF(F9-E9<0,-0.5,IF(E9-F9<0,0.5,0)),IF($BH8,IF($AY8>$AY10,-0.5,IF($AY8<$AY10,0.5,0)),IF($BJ8,IF($BA8>$BA10,-0.5,IF($BA8<$BA10,0.5,0)),0)))","v":0},{"$f":"IF($BN8,IF(E11-F11<0,-0.5,IF(F11-E11<0,0.5,0)),IF($BI8,IF($AZ8>$AZ11,-0.5,IF($AZ8<$AZ11,0.5,0)),IF($BJ8,IF($BA8>$BA11,-0.5, IF($BA8<$BA11,0.5,0)),0)))","v":0},"x",{"$f":"IF(ISBLANK(E7),0,IF(AR8=0,0.5,IF(AR8=3,-0.5,0)))","v":0},{"$f":"IF(ISBLANK(E9),0,IF(AS8=0,0.5,IF(AS8=3,-0.5,0)))","v":0},{"$f":"IF(ISBLANK(F11),0,IF(AT8=0,0.5,IF(AT8=3,-0.5,0)))","v":0.5},null,"x",{"$f":"IF(100*AP8+AN8>=MAX(100*AP11+AN11,100*AP10+AN10),-0.5, 0.5)","v":0.5},{"$f":"IF(100*AP8+AN8>=MAX(100*AP9+AN9,100*AP11+AN11),-0.5, 0.5)","v":0.5},{"$f":"IF(100*AP8+AN8>=MAX(100*AP9+AN9,100*AP10+AN10),-0.5, 0.5)","v":0.5},{"$f":"AND(AM8=AM9,AM9=AM10,AM10=AM11)","v":false},{"$f":"IF(AND(NOT(CF8),AM8=AM9,AM8=AM10),1,0)","v":0},{"$f":"IF(AND(NOT(CF8),AM8=AM9,AM8=AM11),1,0)","v":0},{"$f":"IF(AND(NOT(CF8),AM8=AM10,AM8=AM11),1,0)","v":0},{"$f":"IF(AND(NOT(CF8),AM9=AM10,AM9=AM11),1,0)","v":0},{"$f":"IF(OR(CH8,CI8,CJ8),1,0)","v":0}]
[null,"2012-06-12","20:45:00",{"$f":"D7","v":"Pologne"},1,1,{"$f":"D8","v":"Russie"},null,{"$f":"AH9","v":2},{"$f":"INDEX(AL8:AL11,MATCH(AJ9,$AK8:$AK11,0))","v":"Grèce"},{"$f":"INDEX(AM8:AM11,MATCH(AJ9,$AK8:$AK11,0))","v":4},{"$f":"INDEX(AN8:AN11,MATCH(AJ9,$AK8:$AK11,0))","v":3},{"$f":"INDEX(AO8:AO11,MATCH(AJ9,$AK8:$AK11,0))","v":3},{"$f":"INDEX(AP8:AP11,MATCH(AJ9,$AK8:$AK11,0))","v":0},null,null,null,null,"2012-06-22","20:45:00",{"$f":"IF(OR(I17<2),Data!T27,T(J16))","v":"Allemagne"},null,null,null,null,null,{"$f":"Data!T44","v":"Total"},{"$f":"IF(ISBLANK(Data!T23),\"\",Data!T23)","v":2757},null,null,null,null,null,{"$f":"IF(ROUND(AJ9,0)=ROUND(AJ8,0),AH8,2)","v":2},{"$f":"ROUND(AJ9,0)","v":2},{"$f":"MAX(MIN(AK8:AK10),MIN(AK8,AK9,AK11),MIN(AK8,AK10,AK11),MIN(AK9:AK11))","v":1.96},{"$f":"SUM(BC9:BF9)+2.46","v":1.96},{"$f":"G7","v":"Grèce"},{"$f":"SUM(AQ9:AT9)","v":4},{"$f":"F7+F10+E12","v":3},{"$f":"E7+E10+F12","v":3},{"$f":"AN9-AO9","v":0},{"$f":"IF(ISBLANK(F7),0,IF(AR8=3,0,IF(AR8=1,1,3)))","v":1},"x",{"$f":"IF(ISBLANK(E12),0,IF(AR10=3,0,IF(AR10=1,1,3)))","v":3},{"$f":"IF(ISBLANK(F10),0,IF(F10>E10,3,IF(F10=E10,1,0)))","v":0},{"$f":"(10*(AP8-AP9)+AN8-AN9<0)","v":true},"x",{"$f":"10*(AP9-AP10)+AN9-AN10>0","v":false},{"$f":"10*(AP9-AP11)+AN9-AN11>0","v":true},{"$f":"10000*(AQ9+AS9)+(F7-E7+E12-F12)*100+(F7+E12)","v":40102},{"$f":"10000*(AQ9+AT9)+(F7-E7+F10-E10)*100+(F7+F10)","v":9902},"x",{"$f":"10000*(AS9+AT9)+(F10-E10+E12-F12)*100+(F10+E12)","v":30002},{"$f":"IF($AM8>$AM9,0.5,IF($AM9>$AM8,-0.5,IF(CK8=1,CB9,IF(BW9<>0,BW9,IF(AV8,0.5,IF(AU9,-0.5,BT8))))))","v":-0.5},"x",{"$f":"IF($AM9>$AM10,-0.5,IF($AM10>$AM9,0.5,IF(CK8=1,CD9,IF(BY9<>0,BY9,IF(AW9,-0.5,IF(AV10,0.5,BU9))))))","v":-0.5},{"$f":"IF($AM9>$AM11,-0.5,IF($AM11>$AM9,0.5,IF(CK8=1,CE9,IF(BZ9<>0,BZ9,IF(AX9,-0.5,IF(AV11,0.5,BV9))))))","v":0.5},null,null,null,null,null,null,null,null,null,null,null,null,null,"x",{"$f":"IF($BO8,IF(F12-E12<0,-0.5,IF(E12-F12<0,0.5,0)),IF($BH8,IF($AY9>$AY10,-0.5,IF($AY9<$AY10,0.5,0)),IF($BK8,IF($BB9>$BB10,-0.5,IF($BB9<$BB10,0.5,0)),0)))","v":0},{"$f":"IF($BP8,IF(E10-F10<0,-0.5,IF(F10-E10<0,0.5,0)),IF($BI8,IF($AZ9>$AZ11,-0.5,IF($AZ9<$AZ11,0.5,0)),IF($BK8,IF($BB9>$BB11,-0.5,IF($BB9<$BB11,0.5,0)),0)))","v":0},{"$f":"-BX8","v":0},"x",{"$f":"IF(ISBLANK(E12),0,IF(AS9=0,0.5,IF(AS9=3,-0.5,0)))","v":-0.5},{"$f":"IF(ISBLANK(F10),0,IF(AT9=0,0.5,IF(AT9=3,-0.5,0)))","v":0.5},null,{"$f":"IF(100*AP9+AN9>=MAX(100*AP10+AN10,100*AP11+AN11),-0.5, 0.5)","v":0.5},"x",{"$f":"IF(100*AP9+AN9>=MAX(100*AP8+AN8,100*AP11+AN11),-0.5, 0.5)","v":-0.5},{"$f":"IF(100*AP9+AN9>=MAX(100*AP10+AN10,100*AP8+AN8),-0.5, 0.5)","v":0.5}]
[null,"2012-06-12","18:00:00",{"$f":"G8","v":"Rép.Tchèque"},2,1,{"$f":"G7","v":"Grèce"},null,{"$f":"AH10","v":3},{"$f":"INDEX(AL8:AL11,MATCH(AJ10,$AK8:$AK11,0))","v":"Russie"},{"$f":"INDEX(AM8:AM11,MATCH(AJ10,$AK8:$AK11,0))","v":4},{"$f":"INDEX(AN8:AN11,MATCH(AJ10,$AK8:$AK11,0))","v":5},{"$f":"INDEX(AO8:AO11,MATCH(AJ10,$AK8:$AK11,0))","v":3},{"$f":"INDEX(AP8:AP11,MATCH(AJ10,$AK8:$AK11,0))","v":2},null,null,null,null,null,null,{"$f":"IF(OR(I10<3,I9<2),Data!T27,T(J9))","v":"Grèce"},null,null,null,null,null,null,null,null,null,null,null,null,{"$f":"IF(ROUND(AJ10,0)=ROUND(AJ9,0),AH9,3)","v":3},{"$f":"ROUND(AJ10,0)","v":3},{"$f":"MIN(MAX(AK8:AK10),MAX(AK8,AK9,AK11),MAX(AK8,AK10,AK11),MAX(AK9:AK11))","v":2.97},{"$f":"SUM(BC10:BF10)+2.47","v":2.97},{"$f":"D8","v":"Russie"},{"$f":"SUM(AQ10:AT10)","v":4},{"$f":"E8+F9+F12","v":5},{"$f":"F8+E9+E12","v":3},{"$f":"AN10-AO10","v":2},{"$f":"IF(ISBLANK(F9),0,IF(AS8=3,0,IF(AS8=1,1,3)))","v":1},{"$f":"IF(ISBLANK(F12),0,IF(F12>E12,3,IF(F12=E12,1,0)))","v":0},"x",{"$f":"IF(ISBLANK(E8),0,IF(E8>F8,3,IF(E8=F8,1,0)))","v":3},{"$f":"10*(AP8-AP10)+AN8-AN10<0","v":true},{"$f":"10*(AP9-AP10)+AN9-AN10<0","v":true},"x",{"$f":"10*(AP10-AP11)+AN10-AN11>0","v":true},{"$f":"10000*(AQ10+AR10)+(F9-E9+F12-E12)*100+(F9+F12)","v":9901},"x",{"$f":"10000*(AQ10+AT10)+(E8-F8+F9-E9)*100+(E8+F9)","v":40305},{"$f":"10000*(AR10+AT10)+(E8-F8+F12-E12)*100+(E8+F12)","v":30204},{"$f":"IF($AM8>$AM10,0.5,IF($AM10>$AM8,-0.5,IF(CK8=1,CB10,IF(BW10<>0,BW10,IF(AW8,0.5,IF(AU10,-0.5,BU8))))))","v":-0.5},{"$f":"IF($AM9>$AM10,0.5,IF($AM10>$AM9,-0.5,IF(CK8=1,CC10,IF(BX10<>0,BX10,IF(AW9,0.5,IF(AV10,-0.5,BU9))))))","v":0.5},"x",{"$f":"IF($AM10>$AM11,-0.5,IF($AM11>$AM10,0.5,IF(CK8=1,CE10,IF(BZ10<>0,BZ10,IF(AX10,-0.5,IF(AW11,0.5,BV10))))))","v":0.5},null,null,null,null,null,null,null,null,null,null,null,null,null,null,"x",{"$f":"IF($BQ8,IF(F8-E8<0,-0.5,IF(E8-F8<0,0.5,0)),IF($BJ8,IF($BA10>$BA11,-0.5,IF($BA10<$BA11,0.5,0)),IF($BK8,IF($BB10>$BB11,-0.5,IF($BB10<$BB11,0.5,0)),0)))","v":0},{"$f":"-BY8","v":0},{"$f":"-BY9","v":0.5},"x",{"$f":"IF(ISBLANK(E8),0,IF(AT10=0,0.5,IF(AT10=3,-0.5,0)))","v":-0.5},null,{"$f":"IF(100*AP10+AN10>=MAX(100*AP11+AN11,100*AP9+AN9),-0.5, 0.5)","v":-0.5},{"$f":"IF(100*AP10+AN10>=MAX(100*AP8+AN8,100*AP9+AN9),-0.5, 0.5)","v":-0.5},"x",{"$f":"IF(100*AP10+AN10>=MAX(100*AP8+AN8,100*AP9+AN9),-0.5, 0.5)","v":-0.5}]
[null,"2012-06-16","20:45:00",{"$f":"G8","v":"Rép.Tchèque"},1,0,{"$f":"D7","v":"Pologne"},null,{"$f":"AH11","v":4},{"$f":"INDEX(AL8:AL11,MATCH(AJ11,$AK8:$AK11,0))","v":"Pologne"},{"$f":"INDEX(AM8:AM11,MATCH(AJ11,$AK8:$AK11,0))","v":2},{"$f":"INDEX(AN8:AN11,MATCH(AJ11,$AK8:$AK11,0))","v":2},{"$f":"INDEX(AO8:AO11,MATCH(AJ11,$AK8:$AK11,0))","v":3},{"$f":"INDEX(AP8:AP11,MATCH(AJ11,$AK8:$AK11,0))","v":-1},null,null,null,null,"2012-06-23","20:45:00",{"$f":"IF(OR(I25<2),Data!T27,T(J24))","v":"Espagne"},null,null,null,null,null,null,null,null,null,null,null,null,{"$f":"IF(ROUND(AJ11,0)=ROUND(AJ10,0),AH10,4)","v":4},{"$f":"ROUND(AJ11,0)","v":4},{"$f":"MAX(AK8:AK11)","v":3.95},{"$f":"SUM(BC11:BF11)+2.48","v":0.98},{"$f":"G8","v":"Rép.Tchèque"},{"$f":"SUM(AQ11:AT11)","v":6},{"$f":"F8+E10+E11","v":4},{"$f":"E8+F10+F11","v":5},{"$f":"AN11-AO11","v":-1},{"$f":"IF(ISBLANK(E11),0,IF(AT8=3,0,IF(AT8=1,1,3)))","v":3},{"$f":"IF(ISBLANK(E10),0,IF(AT9=3,0,IF(AT9=1,1,3)))","v":3},{"$f":"IF(ISBLANK(F8),0,IF(AT10=3,0,IF(AT10=1,1,3)))","v":0},"x",{"$f":"10*(AP8-AP11)+AN8-AN11<0","v":true},{"$f":"10*(AP9-AP11)+AN9-AN11<0","v":false},{"$f":"10*(AP10-AP11)+AN10-AN11<0","v":false},"x","x",{"$f":"10000*(AQ11+AR11)+(E11-F11+E10-F10)*100+(E11+E10)","v":60203},{"$f":"10000*(AQ11+AS11)+(F8-E8+E11-F11)*100+(F8+E11)","v":29802},{"$f":"10000*(AR11+AS11)+(E10-F10+F8-E8)*100+(E10+F8)","v":29803},{"$f":"IF($AM8>$AM11,0.5,IF($AM11>$AM8,-0.5,IF(CK8=1,CB11,IF(BW11<>0,BW11,IF(AX8,0.5,IF(AU11,-0.5,BV8))))))","v":-0.5},{"$f":"IF($AM9>$AM11,0.5,IF($AM11>$AM9,-0.5,IF(CK8=1,BX11,IF(BX11<>0,BX11,IF(AX9,0.5,IF(AV11,-0.5,BV9))))))","v":-0.5},{"$f":"IF($AM10>$AM11,0.5,IF($AM11>$AM10,-0.5,IF(CK8=1,CD11,IF(BY11<>0,BY11,IF(AX10,0.5,IF(AW11,-0.5,BV10))))))","v":-0.5},"x",null,null,null,null,null,null,null,null,null,null,null,null,null,null,null,"x",{"$f":"-BZ8","v":-0.5},{"$f":"-BZ9","v":-0.5},{"$f":"-BZ10","v":0.5},"x",null,{"$f":"IF(100*AP11+AN11>=MAX(100*AP9+AN9,100*AP10+AN10),-0.5, 0.5)","v":0.5},{"$f":"IF(100*AP11+AN11>=MAX(100*AP8+AN8,100*AP10+AN10),-0.5, 0.5)","v":0.5},{"$f":"IF(100*AP11+AN11>=MAX(100*AP8+AN8,100*AP9+AN9),-0.5, 0.5)","v":0.5},"x"]
[null,"2012-06-16","20:45:00",{"$f":"G7","v":"Grèce"},1,0,{"$f":"D8","v":"Russie"},null,null,{"$f":"IF(OR(I10<3,I9<2),Data!T27,\" \")","v":" "},null,null,null,null,null,null,null,null,null,null,{"$f":"IF(OR(I34<3,I33<2),Data!T27,T(J33))","v":"Angleterre"}]
[null,null,null,null,null,null,null,null,null,null,null,null,null,null,null,null,null,null,"2012-06-24","20:45:00",{"$f":"IF(OR(I33<2),Data!T27,T(J32))","v":"France"},null,null,null,null,null,null,null,null,null,null,{"$f":"Data!T51","v":"Ne pas toucher cette partie des calculs, sinon :"}]
[null,{"$f":"Data!T30","v":"Groupe B"},null,null,null,null,null,null,null,null,null,null,null,null,null,null,null,null,null,null,{"$f":"IF(OR(I26<3,I25<2),Data!T27,T(J25))","v":"Italie"}]
[null,"2012-06-09","18:00:00",{"$f":"Data!T6","v":"Pays-Bas"},0,1,{"$f":"Data!T7","v":"Danemark"},null,null,{"$f":"Data!T30","v":"Groupe B"},{"$f":"K7","v":"Pts"},{"$f":"L7","v":"BP"},{"$f":"M7","v":"BC"},{"$f":"\"+/-\"","v":"+/-"},null,null,null,null,null,null,null,null,null,null,null,null,null,null,null,null,null,null,null,null,null,null,"Rank","Team","Pts","GF","GA","GD","Ag1","Ag2","Ag3","Ag4","Sp1","Sp2","Sp3","Sp4","T123","T124","T134","T234","Rk1","Rk2","Rk3","Rk4","T1234","T123","T124","T134","T234","T12","T13","T14","T23","T24","T34","NoT","sRk1","sRk2","sRk3","sRk4","T1x","T2x","T3x","T4x"," Règle d","T1x","T2x","T3x","T4x","T1234","T123","T124","T134","T234","TXXX?"]
[null,"2012-06-09","20:45:00",{"$f":"Data!T8","v":"Allemagne"},1,0,{"$f":"Data!T9","v":"Portugal"},null,{"$f":"AH16","v":1},{"$f":"INDEX(AL16:AL19,MATCH(AJ16,$AK16:$AK19,0))","v":"Allemagne"},{"$f":"INDEX(AM16:AM19,MATCH(AJ16,$AK16:$AK19,0))","v":9},{"$f":"INDEX(AN16:AN19,MATCH(AJ16,$AK16:$AK19,0))","v":5},{"$f":"INDEX(AO16:AO19,MATCH(AJ16,$AK16:$AK19,0))","v":2},{"$f":"INDEX(AP16:AP19,MATCH(AJ16,$AK16:$AK19,0))","v":3},null,null,null,null,{"$f":"Data!T34","v":"Demi-finales"},null,null,null,"Pen",null,null,null,null,null,null,null,null,null,null,1,{"$f":"ROUND(AJ16,0)","v":1},{"$f":"MIN(AK16:AK19)","v":0.9700000000000002},{"$f":"SUM(BC16:BF16)+2.45","v":3.95},{"$f":"D15","v":"Pays-Bas"},{"$f":"SUM(AQ16:AT16)","v":0},{"$f":"E15+E17+F19","v":2},{"$f":"F15+F17+E19","v":5},{"$f":"AN16-AO16","v":-3},"x",{"$f":"IF(ISBLANK(E15),0,IF(E15>F15,3,IF(E15=F15,1,0)))","v":0},{"$f":"IF(ISBLANK(E17),0,IF(E17>F17,3,IF(E17=F17,1,0)))","v":0},{"$f":"IF(ISBLANK(F19),0,IF(F19>E19,3,IF(F19=E19,1,0)))","v":0},"x",{"$f":"(10*(AP16-AP17)+AN16-AN17>0)","v":false},{"$f":"10*(AP16-AP18)+AN16-AN18>0","v":false},{"$f":"10*(AP16-AP19)+AN16-AN19>0","v":false},{"$f":"10000*(AR16+AS16)+(E17-F17+E15-F15)*100+(E17+E15)","v":-199},{"$f":"10000*(AR16+AT16)+(E15-F15+F19-E19)*100+(E15+F19)","v":-199},{"$f":"10000*(AS16+AT16)+(F19-E19+E17-F17)*100+(F19+E17)","v":-198},"x","x",{"$f":"IF($AM16>$AM17,-0.5,IF($AM17>$AM16,0.5,IF(CK16=1,CC16,IF(BX16<>0,BX16,IF(AV16,-0.5,IF(AU17,0.5,BT16))))))","v":0.5},{"$f":"IF($AM16>$AM18,-0.5,IF($AM18>$AM16,0.5,IF(CK16=1,CD16,IF(BY16<>0,BY16,IF(AW16,-0.5,IF(AU18,0.5,BU16))))))","v":0.5},{"$f":"IF($AM16>$AM19,-0.5,IF($AM19>$AM16,0.5,IF(CK16=1,CE16,IF(BZ16<>0,BZ16,IF(AX16,-0.5,IF(AU19,0.5,BV16))))))","v":0.5},{"$f":"AND(AND(AM16=AM17,AM17=AM18,AM18=AM19),AND(AN16=AN17,AN17=AN18,AN18=AN19),AND(AO16=AO17,AO17=AO18,AO18=AO19))","v":false},{"$f":"AND(NOT(BG16),AM16=AM17,AM16=AM18,AN16=AN17,AN16=AN18,AO16=AO17,AO16=AO18)","v":false},{"$f":"AND(NOT(BG16),AM16=AM17,AM16=AM19,AN16=AN17,AN16=AN19,AO16=AO17,AO16=AO19)","v":false},{"$f":"AND(NOT(BG16),AM16=AM18,AM16=AM19,AN16=AN18,AN16=AN19,AO16=AO18,AO16=AO19)","v":false},{"$f":"AND(NOT(BG16),AM17=AM18,AM17=AM19,AN17=AN18,AN17=AN19,AO17=AO18,AO17=AO19)","v":false},{"$f":"AND(NOT(BG16),NOT(BH16),NOT(BI16),AM16=AM17,AN16=AN17,AO16=AO17)","v":false},{"$f":"AND(NOT(BG16),NOT(BH16),NOT(BJ16),AM16=AM18,AN16=AN18,AO16=AO18)","v":false},{"$f":"AND(NOT(BG16),NOT(BI16),NOT(BJ16),AM16=AM19,AN16=AN19,AO16=AO19)","v":false},{"$f":"AND(NOT(BG16),NOT(BH16),NOT(BK16),AM17=AM18,AN17=AN18)","v":false},{"$f":"AND(NOT(BG16),NOT(BI16),NOT(BK16),AM17=AM19,AN17=AN19,AO17=AO19)","v":false},{"$f":"AND(NOT(BG16),NOT(BJ16),NOT(BK16),AM18=AM19,AN18=AN19,AO18=AO19)","v":false},{"$f":"AND(NOT(BG16:BQ16))","v":true},"x",{"$f":"IF($BL16,IF(F15-E15<0,-0.5,IF(E15-F15<0,0.5,0)),IF($BH16,IF($AY16>$AY17,-0.5,IF($AY16<$AY17,0.5,0)),IF($BI16,IF($AZ16>$AZ17,-0.5, IF($AZ16<$AZ17,0.5,0)),0)))","v":0},{"$f":"IF($BM16,IF(F17-E17<0,-0.5,IF(E17-F17<0,0.5,0)),IF($BH16,IF($AY16>$AY18,-0.5,IF($AY16<$AY18,0.5,0)),IF($BJ16,IF($BA16>$BA18,-0.5,IF($BA16<$BA18,0.5,0)),0)))","v":0},{"$f":"IF($BN16,IF(E19-F19<0,-0.5,IF(F19-E19<0,0.5,0)),IF($BI16,IF($AZ16>$AZ19,-0.5,IF($AZ16<$AZ19,0.5,0)),IF($BJ16,IF($BA16>$BA19,-0.5, IF($BA16<$BA19,0.5,0)),0)))","v":0},"x",{"$f":"IF(ISBLANK(E15),0,IF(AR16=0,0.5,IF(AR16=3,-0.5,0)))","v":0.5},{"$f":"IF(ISBLANK(E17),0,IF(AS16=0,0.5,IF(AS16=3,-0.5,0)))","v":0.5},{"$f":"IF(ISBLANK(F19),0,IF(AT16=0,0.5,IF(AT16=3,-0.5,0)))","v":0.5},null,"x",{"$f":"IF(100*AP16+AN16>=MAX(100*AP19+AN19,100*AP18+AN18),-0.5, 0.5)","v":0.5},{"$f":"IF(100*AP16+AN16>=MAX(100*AP17+AN17,100*AP19+AN19),-0.5, 0.5)","v":0.5},{"$f":"IF(100*AP16+AN16>=MAX(100*AP17+AN17,100*AP18+AN18),-0.5, 0.5)","v":0.5},{"$f":"AND(AM16=AM17,AM17=AM18,AM18=AM19)","v":false},{"$f":"IF(AND(NOT(CF16),AM16=AM17,AM16=AM18),1,0)","v":0},{"$f":"IF(AND(NOT(CF16),AM16=AM17,AM16=AM19),1,0)","v":0},{"$f":"IF(AND(NOT(CF16),AM16=AM18,AM16=AM19),1,0)","v":0},{"$f":"IF(AND(NOT(CF16),AM17=AM18,AM17=AM19),1,0)","v":0},{"$f":"IF(OR(CH16,CI16,CJ16),1,0)","v":0}]
[null,"2012-06-13","20:45:00",{"$f":"D15","v":"Pays-Bas"},1,2,{"$f":"D16","v":"Allemagne"},null,{"$f":"AH17","v":2},{"$f":"INDEX(AL16:AL19,MATCH(AJ17,$AK16:$AK19,0))","v":"Portugal"},{"$f":"INDEX(AM16:AM19,MATCH(AJ17,$AK16:$AK19,0))","v":6},{"$f":"INDEX(AN16:AN19,MATCH(AJ17,$AK16:$AK19,0))","v":5},{"$f":"INDEX(AO16:AO19,MATCH(AJ17,$AK16:$AK19,0))","v":4},{"$f":"INDEX(AP16:AP19,MATCH(AJ17,$AK16:$AK19,0))","v":1},null,null,null,null,"2012-06-27","20:45:00",{"$f":"IF(100*V7+W7>100*V8+W8,U7,IF(100*V7+W7<100*V8+W8,U8,\"-\"))","v":"-"},null,null,null,null,null,null,null,null,null,null,null,null,{"$f":"IF(ROUND(AJ17,0)=ROUND(AJ16,0),AH16,2)","v":2},{"$f":"ROUND(AJ17,0)","v":2},{"$f":"MAX(MIN(AK16:AK18),MIN(AK16,AK17,AK19),MIN(AK16,AK18,AK19),MIN(AK17:AK19))","v":1.98},{"$f":"SUM(BC17:BF17)+2.46","v":2.96},{"$f":"G15","v":"Danemark"},{"$f":"SUM(AQ17:AT17)","v":3},{"$f":"F15+F18+E20","v":4},{"$f":"E15+E18+F20","v":5},{"$f":"AN17-AO17","v":-1},{"$f":"IF(ISBLANK(F15),0,IF(AR16=3,0,IF(AR16=1,1,3)))","v":3},"x",{"$f":"IF(ISBLANK(E20),0,IF(AR18=3,0,IF(AR18=1,1,3)))","v":0},{"$f":"IF(ISBLANK(F18),0,IF(F18>E18,3,IF(F18=E18,1,0)))","v":0},{"$f":"(10*(AP16-AP17)+AN16-AN17<0)","v":true},"x",{"$f":"10*(AP17-AP18)+AN17-AN18>0","v":false},{"$f":"10*(AP17-AP19)+AN17-AN19>0","v":false},{"$f":"10000*(AQ17+AS17)+(F15-E15+E20-F20)*100+(F15+E20)","v":30002},{"$f":"10000*(AQ17+AT17)+(F15-E15+F18-E18)*100+(F15+F18)","v":30003},"x",{"$f":"10000*(AS17+AT17)+(F18-E18+E20-F20)*100+(F18+E20)","v":-197},{"$f":"IF($AM16>$AM17,0.5,IF($AM17>$AM16,-0.5,IF(CK16=1,CB17,IF(BW17<>0,BW17,IF(AV16,0.5,IF(AU17,-0.5,BT16))))))","v":-0.5},"x",{"$f":"IF($AM17>$AM18,-0.5,IF($AM18>$AM17,0.5,IF(CK16=1,CD17,IF(BY17<>0,BY17,IF(AW17,-0.5,IF(AV18,0.5,BU17))))))","v":0.5},{"$f":"IF($AM17>$AM19,-0.5,IF($AM19>$AM17,0.5,IF(CK16=1,CE17,IF(BZ17<>0,BZ17,IF(AX17,-0.5,IF(AV19,0.5,BV17))))))","v":0.5},null,null,null,null,null,null,null,null,null,null,null,null,null,"x",{"$f":"IF($BO16,IF(F20-E20<0,-0.5,IF(E20-F20<0,0.5,0)),IF($BH16,IF($AY17>$AY18,-0.5,IF($AY17<$AY18,0.5,0)),IF($BK16,IF($BB17>$BB18,-0.5,IF($BB17<$BB18,0.5,0)),0)))","v":0},{"$f":"IF($BP16,IF(E18-F18<0,-0.5,IF(F18-E18<0,0.5,0)),IF($BI16,IF($AZ17>$AZ19,-0.5,IF($AZ17<$AZ19,0.5,0)),IF($BK16,IF($BB17>$BB19,-0.5,IF($BB17<$BB19,0.5,0)),0)))","v":0},{"$f":"-BX16","v":-0.5},"x",{"$f":"IF(ISBLANK(E20),0,IF(AS17=0,0.5,IF(AS17=3,-0.5,0)))","v":0.5},{"$f":"IF(ISBLANK(F18),0,IF(AT17=0,0.5,IF(AT17=3,-0.5,0)))","v":0.5},null,{"$f":"IF(100*AP17+AN17>=MAX(100*AP18+AN18,100*AP19+AN19),-0.5, 0.5)","v":0.5},"x",{"$f":"IF(100*AP17+AN17>=MAX(100*AP16+AN16,100*AP19+AN19),-0.5, 0.5)","v":0.5},{"$f":"IF(100*AP17+AN17>=MAX(100*AP18+AN18,100*AP16+AN16),-0.5, 0.5)","v":0.5}]
[null,"2012-06-13","18:00:00",{"$f":"G16","v":"Portugal"},3,2,{"$f":"G15","v":"Danemark"},null,{"$f":"AH18","v":3},{"$f":"INDEX(AL16:AL19,MATCH(AJ18,$AK16:$AK19,0))","v":"Danemark"},{"$f":"INDEX(AM16:AM19,MATCH(AJ18,$AK16:$AK19,0))","v":3},{"$f":"INDEX(AN16:AN19,MATCH(AJ18,$AK16:$AK19,0))","v":4},{"$f":"INDEX(AO16:AO19,MATCH(AJ18,$AK16:$AK19,0))","v":5},{"$f":"INDEX(AP16:AP19,MATCH(AJ18,$AK16:$AK19,0))","v":-1},null,null,null,null,null,null,{"$f":"IF(100*V11+W11>100*V12+W12,U11,IF(100*V11+W11<100*V12+W12,U12,\"-\"))","v":"-"},null,null,null,null,null,null,null,null,null,null,null,null,{"$f":"IF(ROUND(AJ18,0)=ROUND(AJ17,0),AH17,3)","v":3},{"$f":"ROUND(AJ18,0)","v":3},{"$f":"MIN(MAX(AK16:AK18),MAX(AK16,AK17,AK19),MAX(AK16,AK18,AK19),MAX(AK17:AK19))","v":2.96},{"$f":"SUM(BC18:BF18)+2.47","v":0.9700000000000002},{"$f":"D16","v":"Allemagne"},{"$f":"SUM(AQ18:AT18)","v":9},{"$f":"E16+F17+F20","v":5},{"$f":"F16+E17+E20","v":2},{"$f":"AN18-AO18","v":3},{"$f":"IF(ISBLANK(F17),0,IF(AS16=3,0,IF(AS16=1,1,3)))","v":3},{"$f":"IF(ISBLANK(F20),0,IF(F20>E20,3,IF(F20=E20,1,0)))","v":3},"x",{"$f":"IF(ISBLANK(E16),0,IF(E16>F16,3,IF(E16=F16,1,0)))","v":3},{"$f":"10*(AP16-AP18)+AN16-AN18<0","v":true},{"$f":"10*(AP17-AP18)+AN17-AN18<0","v":true},"x",{"$f":"10*(AP18-AP19)+AN18-AN19>0","v":true},{"$f":"10000*(AQ18+AR18)+(F17-E17+F20-E20)*100+(F17+F20)","v":60204},"x",{"$f":"10000*(AQ18+AT18)+(E16-F16+F17-E17)*100+(E16+F17)","v":60203},{"$f":"10000*(AR18+AT18)+(E16-F16+F20-E20)*100+(E16+F20)","v":60203},{"$f":"IF($AM16>$AM18,0.5,IF($AM18>$AM16,-0.5,IF(CK16=1,CB18,IF(BW18<>0,BW18,IF(AW16,0.5,IF(AU18,-0.5,BU16))))))","v":-0.5},{"$f":"IF($AM17>$AM18,0.5,IF($AM18>$AM17,-0.5,IF(CK16=1,CC18,IF(BX18<>0,BX18,IF(AW17,0.5,IF(AV18,-0.5,BU17))))))","v":-0.5},"x",{"$f":"IF($AM18>$AM19,-0.5,IF($AM19>$AM18,0.5,IF(CK16=1,CE18,IF(BZ18<>0,BZ18,IF(AX18,-0.5,IF(AW19,0.5,BV18))))))","v":-0.5},null,null,null,null,null,null,null,null,null,null,null,null,null,null,"x",{"$f":"IF($BQ16,IF(F16-E16<0,-0.5,IF(E16-F16<0,0.5,0)),IF($BJ16,IF($BA18>$BA19,-0.5,IF($BA18<$BA19,0.5,0)),IF($BK16,IF($BB18>$BB19,-0.5,IF($BB18<$BB19,0.5,0)),0)))","v":0},{"$f":"-BY16","v":-0.5},{"$f":"-BY17","v":-0.5},"x",{"$f":"IF(ISBLANK(E16),0,IF(AT18=0,0.5,IF(AT18=3,-0.5,0)))","v":-0.5},null,{"$f":"IF(100*AP18+AN18>=MAX(100*AP19+AN19,100*AP17+AN17),-0.5, 0.5)","v":-0.5},{"$f":"IF(100*AP18+AN18>=MAX(100*AP16+AN16,100*AP17+AN17),-0.5, 0.5)","v":-0.5},"x",{"$f":"IF(100*AP18+AN18>=MAX(100*AP16+AN16,100*AP17+AN17),-0.5, 0.5)","v":-0.5}]
[null,"2012-06-17","20:45:00",{"$f":"G16","v":"Portugal"},2,1,{"$f":"D15","v":"Pays-Bas"},null,{"$f":"AH19","v":4},{"$f":"INDEX(AL16:AL19,MATCH(AJ19,$AK16:$AK19,0))","v":"Pays-Bas"},{"$f":"INDEX(AM16:AM19,MATCH(AJ19,$AK16:$AK19,0))","v":0},{"$f":"INDEX(AN16:AN19,MATCH(AJ19,$AK16:$AK19,0))","v":2},{"$f":"INDEX(AO16:AO19,MATCH(AJ19,$AK16:$AK19,0))","v":5},{"$f":"INDEX(AP16:AP19,MATCH(AJ19,$AK16:$AK19,0))","v":-3},null,null,null,null,"2012-06-28","20:45:00",{"$f":"IF(100*V9+W9>100*V10+W10,U9,IF(100*V9+W9<100*V10+W10,U10,\"-\"))","v":"-"},null,null,null,null,null,null,null,null,null,null,null,null,{"$f":"IF(ROUND(AJ19,0)=ROUND(AJ18,0),AH18,4)","v":4},{"$f":"ROUND(AJ19,0)","v":4},{"$f":"MAX(AK16:AK19)","v":3.95},{"$f":"SUM(BC19:BF19)+2.48","v":1.98},{"$f":"G16","v":"Portugal"},{"$f":"SUM(AQ19:AT19)","v":6},{"$f":"F16+E18+E19","v":5},{"$f":"E16+F18+F19","v":4},{"$f":"AN19-AO19","v":1},{"$f":"IF(ISBLANK(E19),0,IF(AT16=3,0,IF(AT16=1,1,3)))","v":3},{"$f":"IF(ISBLANK(E18),0,IF(AT17=3,0,IF(AT17=1,1,3)))","v":3},{"$f":"IF(ISBLANK(F16),0,IF(AT18=3,0,IF(AT18=1,1,3)))","v":0},"x",{"$f":"10*(AP16-AP19)+AN16-AN19<0","v":true},{"$f":"10*(AP17-AP19)+AN17-AN19<0","v":true},{"$f":"10*(AP18-AP19)+AN18-AN19<0","v":false},"x","x",{"$f":"10000*(AQ19+AR19)+(E18-F18+E19-F19)*100+(E18+E19)","v":60205},{"$f":"10000*(AQ19+AS19)+(E19-F19+F16-E16)*100+(E19+F16)","v":30002},{"$f":"10000*(AR19+AS19)+(E18-F18+F16-E16)*100+(E18+F16)","v":30003},{"$f":"IF($AM16>$AM19,0.5,IF($AM19>$AM16,-0.5,IF(CK16=1,CB19,IF(BW19<>0,BW19,IF(AX16,0.5,IF(AU19,-0.5,BV16))))))","v":-0.5},{"$f":"IF($AM17>$AM19,0.5,IF($AM19>$AM17,-0.5,IF(CK16=1,BX19,IF(BX19<>0,BX19,IF(AX17,0.5,IF(AV19,-0.5,BV17))))))","v":-0.5},{"$f":"IF($AM18>$AM19,0.5,IF($AM19>$AM18,-0.5,IF(CK16=1,CD19,IF(BY19<>0,BY19,IF(AX18,0.5,IF(AW19,-0.5,BV18))))))","v":0.5},"x",null,null,null,null,null,null,null,null,null,null,null,null,null,null,null,"x",{"$f":"-BZ16","v":-0.5},{"$f":"-BZ17","v":-0.5},{"$f":"-BZ18","v":0.5},"x",null,{"$f":"IF(100*AP19+AN19>=MAX(100*AP17+AN17,100*AP18+AN18),-0.5, 0.5)","v":0.5},{"$f":"IF(100*AP19+AN19>=MAX(100*AP16+AN16,100*AP18+AN18),-0.5, 0.5)","v":0.5},{"$f":"IF(100*AP19+AN19>=MAX(100*AP16+AN16,100*AP17+AN17),-0.5, 0.5)","v":-0.5},"x"]
[null,"2012-06-17","20:45:00",{"$f":"G15","v":"Danemark"},1,2,{"$f":"D16","v":"Allemagne"},null,null,{"$f":"IF(OR(I18<3,I17<2),Data!T27,\" \")","v":" "},null,null,null,null,null,null,null,null,null,null,{"$f":"IF(100*V13+W13>100*V14+W14,U13,IF(100*V13+W13<100*V14+W14,U14,\"-\"))","v":"-"}]
[]
[null,{"$f":"Data!T31","v":"Groupe C"},null,null,null,null,null,null,null,null,null,null,null,null,null,null,null,null,{"$f":"Data!T35","v":"Finale"},null,null,null,"Pen",null,null,null,null,null,null,null,null,null,null,null,null,null,null,null,null,null,null,null,null,null,null,null,null,null,null,null,null,null,null,null,null,null,null,null,null,null,null,null,null,null,null,null,null,null,null,null,null,null,null,null,null,null,null,null,null,null,null,null,null,null,null,null,null,null,null,"Egalité 3 équipes"]
[null,"2012-06-10","18:00:00",{"$f":"Data!T10","v":"Espagne"},1,1,{"$f":"Data!T11","v":"Italie"},null,null,{"$f":"Data!T31","v":"Groupe C"},{"$f":"K7","v":"Pts"},{"$f":"L7","v":"BP"},{"$f":"M7","v":"BC"},{"$f":"\"+/-\"","v":"+/-"},null,null,null,null,null,null,null,null,null,null,null,null,null,null,null,null,null,null,null,null,null,null,"Rank","Team","Pts","GF","GA","GD","Ag1","Ag2","Ag3","Ag4","Sp1","Sp2","Sp3","Sp4","T123","T124","T134","T234","Rk1","Rk2","Rk3","Rk4","T1234","T123","T124","T134","T234","T12","T13","T14","T23","T24","T34","NoT","sRk1","sRk2","sRk3","sRk4","T1x","T2x","T3x","T4x"," Règle d","T1x","T2x","T3x","T4x","T1234","T123","T124","T134","T234","TXXX?",1,2,3,4]
[null,"2012-06-10","20:45:00",{"$f":"Data!T12","v":"Irlande"},1,3,{"$f":"Data!T13","v":"Croatie"},null,{"$f":"AH24","v":1},{"$f":"INDEX(AL24:AL27,MATCH(AJ24,$AK24:$AK27,0))","v":"Espagne"},{"$f":"INDEX(AM24:AM27,MATCH(AJ24,$AK24:$AK27,0))","v":7},{"$f":"INDEX(AN24:AN27,MATCH(AJ24,$AK24:$AK27,0))","v":6},{"$f":"INDEX(AO24:AO27,MATCH(AJ24,$AK24:$AK27,0))","v":1},{"$f":"INDEX(AP24:AP27,MATCH(AJ24,$AK24:$AK27,0))","v":5},null,null,null,null,"2012-07-01","20:45:00",{"$f":"IF(100*V17+W17>100*V18+W18,U17,IF(100*V17+W17<100*V18+W18,U18,\"-\"))","v":"-"},null,null,null,null,null,null,null,null,null,null,null,null,1,{"$f":"ROUND(AJ24,0)","v":1},{"$f":"MIN(AK24:AK27)","v":0.95000000000000018},{"$f":"SUM(BC24:BF24)+2.45","v":0.95000000000000018},{"$f":"D23","v":"Espagne"},{"$f":"SUM(AQ24:AT24)","v":7},{"$f":"E23+E25+F27","v":6},{"$f":"F23+F25+E27","v":1},{"$f":"AN24-AO24","v":5},"x",{"$f":"IF(ISBLANK(E23),0,IF(E23>F23,3,IF(E23=F23,1,0)))","v":1},{"$f":"IF(ISBLANK(E25),0,IF(E25>F25,3,IF(E25=F25,1,0)))","v":3},{"$f":"IF(ISBLANK(F27),0,IF(F27>E27,3,IF(F27=E27,1,0)))","v":3},"x",{"$f":"(10*(AP24-AP25)+AN24-AN25>0)","v":true},{"$f":"10*(AP24-AP26)+AN24-AN26>0","v":true},{"$f":"10*(AP24-AP27)+AN24-AN27>0","v":true},{"$f":"10000*(AR24+AS24)+(E25-F25+E23-F23)*100+(E25+E23)","v":40405},{"$f":"10000*(AR24+AT24)+(E23-F23+F27-E27)*100+(E23+F27)+(AY24+BA24)/1000000","v":40102.100910000001},{"$f":"10000*(AS24+AT24)+(F27-E27+E25-F25)*100+(F27+E25)","v":60505},"x","x",{"$f":"IF($AM24>$AM25,-0.5,IF($AM25>$AM24,0.5,IF(CK24=1,CC24,IF(BX24<>0,BX24,IF(AV24,-0.5,IF(AU25,0.5,BT24))))))","v":-0.5},{"$f":"IF($AM24>$AM26,-0.5,IF($AM26>$AM24,0.5,IF(CK24=1,CD24,IF(BY24<>0,BY24,IF(AW24,-0.5,IF(AU26,0.5,BU24))))))","v":-0.5},{"$f":"IF($AM24>$AM27,-0.5,IF($AM27>$AM24,0.5,IF(CK24=1,CE24,IF(BZ24<>0,BZ24,IF(AX24,-0.5,IF(AU27,0.5,BV24))))))","v":-0.5},{"$f":"AND(AND(AM24=AM25,AM25=AM26,AM26=AM27),AND(AN24=AN25,AN25=AN26,AN26=AN27),AND(AO24=AO25,AO25=AO26,AO26=AO27))","v":false},{"$f":"AND(NOT(BG24),AM24=AM25,AM24=AM26,AN24=AN25,AN24=AN26,AO24=AO25,AO24=AO26)","v":false},{"$f":"AND(NOT(BG24),AM24=AM25,AM24=AM27,AN24=AN25,AN24=AN27,AO24=AO25,AO24=AO27)","v":false},{"$f":"AND(NOT(BG24),AM24=AM26,AM24=AM27,AN24=AN26,AN24=AN27,AO24=AO26,AO24=AO27)","v":false},{"$f":"AND(NOT(BG24),AM25=AM26,AM25=AM27,AN25=AN26,AN25=AN27,AO25=AO26,AO25=AO27)","v":false},{"$f":"AND(NOT(BG24),NOT(BH24),NOT(BI24),AM24=AM25,AN24=AN25,AO24=AO25)","v":false},{"$f":"AND(NOT(BG24),NOT(BH24),NOT(BJ24),AM24=AM26,AN24=AN26,AO24=AO26)","v":false},{"$f":"AND(NOT(BG24),NOT(BI24),NOT(BJ24),AM24=AM27,AN24=AN27,AO24=AO27)","v":false},{"$f":"AND(NOT(BG24),NOT(BH24),NOT(BK24),AM25=AM26,AN25=AN26)","v":false},{"$f":"AND(NOT(BG24),NOT(BI24),NOT(BK24),AM25=AM27,AN25=AN27,AO25=AO27)","v":false},{"$f":"AND(NOT(BG24),NOT(BJ24),NOT(BK24),AM26=AM27,AN26=AN27,AO26=AO27)","v":false},{"$f":"AND(NOT(BG24:BQ24))","v":true},"x",{"$f":"IF($BL24,IF(F23-E23<0,-0.5,IF(E23-F23<0,0.5,0)),IF($BH24,IF($AY24>$AY25,-0.5,IF($AY24<$AY25,0.5,0)),IF($BI24,IF($AZ24>$AZ25,-0.5, IF($AZ24<$AZ25,0.5,0)),0)))","v":0},{"$f":"IF($BM24,IF(F25-E25<0,-0.5,IF(E25-F25<0,0.5,0)),IF($BH24,IF($AY24>$AY26,-0.5,IF($AY24<$AY26,0.5,0)),IF($BJ24,IF($BA24>$BA26,-0.5,IF($BA24<$BA26,0.5,0)),0)))","v":0},{"$f":"IF($BN24,IF(E27-F27<0,-0.5,IF(F27-E27<0,0.5,0)),IF($BI24,IF($AZ24>$AZ27,-0.5,IF($AZ24<$AZ27,0.5,0)),IF($BJ24,IF($BA24>$BA27,-0.5, IF($BA24<$BA27,0.5,0)),0)))","v":0},"x",{"$f":"IF(ISBLANK(E23),0,IF(AR24=0,0.5,IF(AR24=3,-0.5,0)))","v":0},{"$f":"IF(ISBLANK(E25),0,IF(AS24=0,0.5,IF(AS24=3,-0.5,0)))","v":-0.5},{"$f":"IF(ISBLANK(F27),0,IF(AT24=0,0.5,IF(AT24=3,-0.5,0)))","v":-0.5},null,"x",{"$f":"CN24","v":-0.5},{"$f":"CN24","v":-0.5},{"$f":"CN24","v":-0.5},{"$f":"AND(AM24=AM25,AM25=AM26,AM26=AM27)","v":false},{"$f":"IF(AND(NOT(CF24),AM24=AM25,AM24=AM26),1,0)","v":0},{"$f":"IF(AND(NOT(CF24),AM24=AM25,AM24=AM27),1,0)","v":0},{"$f":"IF(AND(NOT(CF24),AM24=AM26,AM24=AM27),1,0)","v":0},{"$f":"IF(AND(NOT(CF24),AM25=AM26,AM25=AM27),1,0)","v":0},{"$f":"IF(OR(CH24,CI24,CJ24),1,0)","v":0},"x",null,{"$f":"IF(AZ24>MAX(AZ25,AZ27),-0.5,IF(AZ24<MIN(AZ25,AZ27),0.5,0))","v":-0.5}]
[null,"2012-06-14","20:45:00",{"$f":"D23","v":"Espagne"},4,0,{"$f":"D24","v":"Irlande"},null,{"$f":"AH25","v":2},{"$f":"INDEX(AL24:AL27,MATCH(AJ25,$AK24:$AK27,0))","v":"Italie"},{"$f":"INDEX(AM24:AM27,MATCH(AJ25,$AK24:$AK27,0))","v":5},{"$f":"INDEX(AN24:AN27,MATCH(AJ25,$AK24:$AK27,0))","v":4},{"$f":"INDEX(AO24:AO27,MATCH(AJ25,$AK24:$AK27,0))","v":2},{"$f":"INDEX(AP24:AP27,MATCH(AJ25,$AK24:$AK27,0))","v":2},null,null,null,null,null,null,{"$f":"IF(100*V19+W19>100*V20+W20,U19,IF(100*V19+W19<100*V20+W20,U20,\"-\"))","v":"-"},null,null,null,null,null,null,null,null,null,null,null,null,{"$f":"IF(ROUND(AJ25,0)=ROUND(AJ24,0),AH24,2)","v":2},{"$f":"ROUND(AJ25,0)","v":2},{"$f":"MAX(MIN(AK24:AK26),MIN(AK24,AK25,AK27),MIN(AK24,AK26,AK27),MIN(AK25:AK27))","v":1.96},{"$f":"SUM(BC25:BF25)+2.46","v":1.96},{"$f":"G23","v":"Italie"},{"$f":"SUM(AQ25:AT25)","v":5},{"$f":"F23+F26+E28","v":4},{"$f":"E23+E26+F28","v":2},{"$f":"AN25-AO25","v":2},{"$f":"IF(ISBLANK(F23),0,IF(AR24=3,0,IF(AR24=1,1,3)))","v":1},"x",{"$f":"IF(ISBLANK(E28),0,IF(AR26=3,0,IF(AR26=1,1,3)))","v":3},{"$f":"IF(ISBLANK(F26),0,IF(F26>E26,3,IF(F26=E26,1,0)))","v":1},{"$f":"(10*(AP24-AP25)+AN24-AN25<0)","v":false},"x",{"$f":"10*(AP25-AP26)+AN25-AN26>0","v":true},{"$f":"10*(AP25-AP27)+AN25-AN27>0","v":true},{"$f":"10000*(AQ25+AS25)+(F23-E23+E28-F28)*100+(F23+E28)","v":40203},{"$f":"10000*(AQ25+AT25)+(F23-E23+F26-E26)*100+(F23+F26)+(AY25+BB25)/1000000","v":20002.080406000001},"x",{"$f":"10000*(AS25+AT25)+(F26-E26+E28-F28)*100+(F26+E28)","v":40203},{"$f":"IF($AM24>$AM25,0.5,IF($AM25>$AM24,-0.5,IF(CK24=1,CB25,IF(BW25<>0,BW25,IF(AV24,0.5,IF(AU25,-0.5,BT24))))))","v":0.5},"x",{"$f":"IF($AM25>$AM26,-0.5,IF($AM26>$AM25,0.5,IF(CK24=1,CD25,IF(BY25<>0,BY25,IF(AW25,-0.5,IF(AV26,0.5,BU25))))))","v":-0.5},{"$f":"IF($AM25>$AM27,-0.5,IF($AM27>$AM25,0.5,IF(CK24=1,CE25,IF(BZ25<>0,BZ25,IF(AX25,-0.5,IF(AV27,0.5,BV25))))))","v":-0.5},null,null,null,null,null,null,null,null,null,null,null,null,null,"x",{"$f":"IF($BO24,IF(F28-E28<0,-0.5,IF(E28-F28<0,0.5,0)),IF($BH24,IF($AY25>$AY26,-0.5,IF($AY25<$AY26,0.5,0)),IF($BK24,IF($BB25>$BB26,-0.5,IF($BB25<$BB26,0.5,0)),0)))","v":0},{"$f":"IF($BP24,IF(E26-F26<0,-0.5,IF(F26-E26<0,0.5,0)),IF($BI24,IF($AZ25>$AZ27,-0.5,IF($AZ25<$AZ27,0.5,0)),IF($BK24,IF($BB25>$BB27,-0.5,IF($BB25<$BB27,0.5,0)),0)))","v":0},{"$f":"-BX24","v":0},"x",{"$f":"IF(ISBLANK(E28),0,IF(AS25=0,0.5,IF(AS25=3,-0.5,0)))","v":-0.5},{"$f":"IF(ISBLANK(F26),0,IF(AT25=0,0.5,IF(AT25=3,-0.5,0)))","v":0},null,{"$f":"CN25","v":0},"x",{"$f":"CN25","v":0},{"$f":"CN25","v":0},null,null,null,null,null,null,null,"x",{"$f":"IF(AZ25>MAX(AZ24,AZ27),-0.5,IF(AZ25<MIN(AZ24,AZ27),0.5,0))","v":0}]
[null,"2012-06-14","18:00:00",{"$f":"G24","v":"Croatie"},1,1,{"$f":"G23","v":"Italie"},null,{"$f":"AH26","v":3},{"$f":"INDEX(AL24:AL27,MATCH(AJ26,$AK24:$AK27,0))","v":"Croatie"},{"$f":"INDEX(AM24:AM27,MATCH(AJ26,$AK24:$AK27,0))","v":4},{"$f":"INDEX(AN24:AN27,MATCH(AJ26,$AK24:$AK27,0))","v":4},{"$f":"INDEX(AO24:AO27,MATCH(AJ26,$AK24:$AK27,0))","v":3},{"$f":"INDEX(AP24:AP27,MATCH(AJ26,$AK24:$AK27,0))","v":1},null,null,null,null,null,null,null,null,null,null,null,null,null,null,null,null,null,null,null,{"$f":"IF(ROUND(AJ26,0)=ROUND(AJ25,0),AH25,3)","v":3},{"$f":"ROUND(AJ26,0)","v":3},{"$f":"MIN(MAX(AK24:AK26),MAX(AK24,AK25,AK27),MAX(AK24,AK26,AK27),MAX(AK25:AK27))","v":2.98},{"$f":"SUM(BC26:BF26)+2.47","v":3.97},{"$f":"D24","v":"Irlande"},{"$f":"SUM(AQ26:AT26)","v":0},{"$f":"E24+F25+F28","v":1},{"$f":"F24+E25+E28","v":9},{"$f":"AN26-AO26","v":-8},{"$f":"IF(ISBLANK(F25),0,IF(AS24=3,0,IF(AS24=1,1,3)))","v":0},{"$f":"IF(ISBLANK(F28),0,IF(F28>E28,3,IF(F28=E28,1,0)))","v":0},"x",{"$f":"IF(ISBLANK(E24),0,IF(E24>F24,3,IF(E24=F24,1,0)))","v":0},{"$f":"10*(AP24-AP26)+AN24-AN26<0","v":false},{"$f":"10*(AP25-AP26)+AN25-AN26<0","v":false},"x",{"$f":"10*(AP26-AP27)+AN26-AN27>0","v":false},{"$f":"10000*(AQ26+AR26)+(F25-E25+F28-E28)*100+(F25+F28)","v":-600},"x",{"$f":"10000*(AQ26+AT26)+(E24-F24+F25-E25)*100+(E24+F25)","v":-599},{"$f":"10000*(AR26+AT26)+(E24-F24+F28-E28)*100+(E24+F28)","v":-399},{"$f":"IF($AM24>$AM26,0.5,IF($AM26>$AM24,-0.5,IF(CK24=1,CB26,IF(BW26<>0,BW26,IF(AW24,0.5,IF(AU26,-0.5,BU24))))))","v":0.5},{"$f":"IF($AM25>$AM26,0.5,IF($AM26>$AM25,-0.5,IF(CK24=1,CC26,IF(BX26<>0,BX26,IF(AW25,0.5,IF(AV26,-0.5,BU25))))))","v":0.5},"x",{"$f":"IF($AM26>$AM27,-0.5,IF($AM27>$AM26,0.5,IF(CK24=1,CE26,IF(BZ26<>0,BZ26,IF(AX26,-0.5,IF(AW27,0.5,BV26))))))","v":0.5},null,null,null,null,null,null,null,null,null,null,null,null,null,null,"x",{"$f":"IF($BQ24,IF(F24-E24<0,-0.5,IF(E24-F24<0,0.5,0)),IF($BJ24,IF($BA26>$BA27,-0.5,IF($BA26<$BA27,0.5,0)),IF($BK24,IF($BB26>$BB27,-0.5,IF($BB26<$BB27,0.5,0)),0)))","v":0},{"$f":"-BY24","v":0.5},{"$f":"-BY25","v":0.5},"x",{"$f":"IF(ISBLANK(E24),0,IF(AT26=0,0.5,IF(AT26=3,-0.5,0)))","v":0.5},null,{"$f":"IF(100*AP26+AN26>=MAX(100*AP27+AN27,100*AP25+AN25),-0.5, 0.5)","v":0.5},{"$f":"IF(100*AP26+AN26>=MAX(100*AP24+AN24,100*AP25+AN25),-0.5, 0.5)","v":0.5},"x",{"$f":"IF(100*AP26+AN26>=MAX(100*AP24+AN24,100*AP25+AN25),-0.5, 0.5)","v":0.5},null,null,null,null,null,null,null,null,"x"]
[null,"2012-06-18","20:45:00",{"$f":"G24","v":"Croatie"},0,1,{"$f":"D23","v":"Espagne"},null,{"$f":"AH27","v":4},{"$f":"INDEX(AL24:AL27,MATCH(AJ27,$AK24:$AK27,0))","v":"Irlande"},{"$f":"INDEX(AM24:AM27,MATCH(AJ27,$AK24:$AK27,0))","v":0},{"$f":"INDEX(AN24:AN27,MATCH(AJ27,$AK24:$AK27,0))","v":1},{"$f":"INDEX(AO24:AO27,MATCH(AJ27,$AK24:$AK27,0))","v":9},{"$f":"INDEX(AP24:AP27,MATCH(AJ27,$AK24:$AK27,0))","v":-8},null,null,null,null,{"$f":"Data!T36","v":"Vainqueur"},null,{"$f":"IF(100*V24+W24>100*V25+W25,U24,IF(100*V25+W25>100*V24+W24,U25,\"-\"))","v":"-"},null,null,null,{"$f":"Data!T37","v":"Finaliste"},null,{"$f":"IF(100*V24+W24>100*V25+W25,U25,IF(100*V25+W25>100*V24+W24,U24,\"-\"))","v":"-"},null,null,null,null,null,null,{"$f":"IF(ROUND(AJ27,0)=ROUND(AJ26,0),AH26,4)","v":4},{"$f":"ROUND(AJ27,0)","v":4},{"$f":"MAX(AK24:AK27)","v":3.97},{"$f":"SUM(BC27:BF27)+2.48","v":2.98},{"$f":"G24","v":"Croatie"},{"$f":"SUM(AQ27:AT27)","v":4},{"$f":"F24+E26+E27","v":4},{"$f":"E24+F26+F27","v":3},{"$f":"AN27-AO27","v":1},{"$f":"IF(ISBLANK(E27),0,IF(AT24=3,0,IF(AT24=1,1,3)))","v":0},{"$f":"IF(ISBLANK(E26),0,IF(AT25=3,0,IF(AT25=1,1,3)))","v":1},{"$f":"IF(ISBLANK(F24),0,IF(AT26=3,0,IF(AT26=1,1,3)))","v":3},"x",{"$f":"10*(AP24-AP27)+AN24-AN27<0","v":false},{"$f":"10*(AP25-AP27)+AN25-AN27<0","v":false},{"$f":"10*(AP26-AP27)+AN26-AN27<0","v":true},"x","x",{"$f":"10000*(AQ27+AR27)+(E26-F26+E27-F27)*100+(E26+E27)+(BA27+BB27)/1000000","v":9901.070307},{"$f":"10000*(AQ27+AS27)+(E27-F27+F24-E24)*100+(E27+F24)","v":30103},{"$f":"10000*(AR27+AS27)+(E26-F26+F24-E24)*100+(E26+F24)","v":40204},{"$f":"IF($AM24>$AM27,0.5,IF($AM27>$AM24,-0.5,IF(CK24=1,CB27,IF(BW27<>0,BW27,IF(AX24,0.5,IF(AU27,-0.5,BV24))))))","v":0.5},{"$f":"IF($AM25>$AM27,0.5,IF($AM27>$AM25,-0.5,IF(CK24=1,BX27,IF(BX27<>0,BX27,IF(AX25,0.5,IF(AV27,-0.5,BV25))))))","v":0.5},{"$f":"IF($AM26>$AM27,0.5,IF($AM27>$AM26,-0.5,IF(CK24=1,CD27,IF(BY27<>0,BY27,IF(AX26,0.5,IF(AW27,-0.5,BV26))))))","v":-0.5},"x",null,null,null,null,null,null,null,null,null,null,null,null,null,null,null,"x",{"$f":"-BZ24","v":0.5},{"$f":"-BZ25","v":0},{"$f":"-BZ26","v":-0.5},"x",null,{"$f":"CN27","v":0.5},{"$f":"CN27","v":0.5},{"$f":"CN27","v":0.5},"x",null,null,null,null,null,null,null,null,{"$f":"IF(AZ27>MAX(AZ25,AZ24),-0.5,0.5)","v":0.5},"x"]
[null,"2012-06-18","20:45:00",{"$f":"G23","v":"Italie"},2,0,{"$f":"D24","v":"Irlande"},null,null,{"$f":"IF(OR(I26<3,I25<2),Data!T27,\" \")","v":" "}]
[]
[null,{"$f":"Data!T32","v":"Groupe D"}]
[null,"2012-06-11","18:00:00",{"$f":"Data!T16","v":"France"},1,1,{"$f":"Data!T17","v":"Angleterre"},null,null,{"$f":"Data!T32","v":"Groupe D"},{"$f":"K7","v":"Pts"},{"$f":"L7","v":"BP"},{"$f":"M7","v":"BC"},{"$f":"\"+/-\"","v":"+/-"},null,null,null,null,null,null,null,null,null,null,null,null,null,null,null,null,null,null,null,null,null,null,"Rank","Team","Pts","GF","GA","GD","Ag1","Ag2","Ag3","Ag4","Sp1","Sp2","Sp3","Sp4","T123","T124","T134","T234","Rk1","Rk2","Rk3","Rk4","T1234","T123","T124","T134","T234","T12","T13","T14","T23","T24","T34","NoT","sRk1","sRk2","sRk3","sRk4","T1x","T2x","T3x","T4x"," Règle d","T1x","T2x","T3x","T4x","T1234","T123","T124","T134","T234","TXXX?"]
[null,"2012-06-11","20:45:00",{"$f":"Data!T14","v":"Ukraine"},2,1,{"$f":"Data!T15","v":"Suède"},null,{"$f":"AH32","v":1},{"$f":"INDEX(AL32:AL35,MATCH(AJ32,$AK32:$AK35,0))","v":"France"},{"$f":"INDEX(AM32:AM35,MATCH(AJ32,$AK32:$AK35,0))","v":4},{"$f":"INDEX(AN32:AN35,MATCH(AJ32,$AK32:$AK35,0))","v":3},{"$f":"INDEX(AO32:AO35,MATCH(AJ32,$AK32:$AK35,0))","v":1},{"$f":"INDEX(AP32:AP35,MATCH(AJ32,$AK32:$AK35,0))","v":2},null,null,null,null,null,null,null,null,null,null,null,null,null,null,null,null,null,null,null,1,{"$f":"ROUND(AJ32,0)","v":1},{"$f":"MIN(AK32:AK35)","v":0.95000000000000018},{"$f":"SUM(BC32:BF32)+2.45","v":0.95000000000000018},{"$f":"D31","v":"France"},{"$f":"SUM(AQ32:AT32)","v":4},{"$f":"E31+E33+F35","v":3},{"$f":"F31+F33+E35","v":1},{"$f":"AN32-AO32","v":2},"x",{"$f":"IF(ISBLANK(E31),0,IF(E31>F31,3,IF(E31=F31,1,0)))","v":1},{"$f":"IF(ISBLANK(E33),0,IF(E33>F33,3,IF(E33=F33,1,0)))","v":3},{"$f":"IF(ISBLANK(F35),0,IF(F35>E35,3,IF(F35=E35,1,0)))","v":0},"x",{"$f":"(10*(AP32-AP33)+AN32-AN33>0)","v":true},{"$f":"10*(AP32-AP34)+AN32-AN34>0","v":true},{"$f":"10*(AP32-AP35)+AN32-AN35>0","v":true},{"$f":"10000*(AR32+AS32)+(E33-F33+E31-F31)*100+(E33+E31)","v":40203},{"$f":"10000*(AR32+AT32)+(E31-F31+F35-E35)*100+(E31+F35)","v":10001},{"$f":"10000*(AS32+AT32)+(F35-E35+E33-F33)*100+(F35+E33)","v":30202},"x","x",{"$f":"IF($AM32>$AM33,-0.5,IF($AM33>$AM32,0.5,IF(CK32=1,CC32,IF(BX32<>0,BX32,IF(AV32,-0.5,IF(AU33,0.5,BT32))))))","v":-0.5},{"$f":"IF($AM32>$AM34,-0.5,IF($AM34>$AM32,0.5,IF(CK32=1,CD32,IF(BY32<>0,BY32,IF(AW32,-0.5,IF(AU34,0.5,BU32))))))","v":-0.5},{"$f":"IF($AM32>$AM35,-0.5,IF($AM35>$AM32,0.5,IF(CK32=1,CE32,IF(BZ32<>0,BZ32,IF(AX32,-0.5,IF(AU35,0.5,BV32))))))","v":-0.5},{"$f":"AND(AND(AM32=AM33,AM33=AM34,AM34=AM35),AND(AN32=AN33,AN33=AN34,AN34=AN35),AND(AO32=AO33,AO33=AO34,AO34=AO35))","v":false},{"$f":"AND(NOT(BG32),AM32=AM33,AM32=AM34,AN32=AN33,AN32=AN34,AO32=AO33,AO32=AO34)","v":false},{"$f":"AND(NOT(BG32),AM32=AM33,AM32=AM35,AN32=AN33,AN32=AN35,AO32=AO33,AO32=AO35)","v":false},{"$f":"AND(NOT(BG32),AM32=AM34,AM32=AM35,AN32=AN34,AN32=AN35,AO32=AO34,AO32=AO35)","v":false},{"$f":"AND(NOT(BG32),AM33=AM34,AM33=AM35,AN33=AN34,AN33=AN35,AO33=AO34,AO33=AO35)","v":false},{"$f":"AND(NOT(BG32),NOT(BH32),NOT(BI32),AM32=AM33,AN32=AN33,AO32=AO33)","v":false},{"$f":"AND(NOT(BG32),NOT(BH32),NOT(BJ32),AM32=AM34,AN32=AN34,AO32=AO34)","v":false},{"$f":"AND(NOT(BG32),NOT(BI32),NOT(BJ32),AM32=AM35,AN32=AN35,AO32=AO35)","v":false},{"$f":"AND(NOT(BG32),NOT(BH32),NOT(BK32),AM33=AM34,AN33=AN34)","v":false},{"$f":"AND(NOT(BG32),NOT(BI32),NOT(BK32),AM33=AM35,AN33=AN35,AO33=AO35)","v":false},{"$f":"AND(NOT(BG32),NOT(BJ32),NOT(BK32),AM34=AM35,AN34=AN35,AO34=AO35)","v":false},{"$f":"AND(NOT(BG32:BQ32))","v":true},"x",{"$f":"IF($BL32,IF(F31-E31<0,-0.5,IF(E31-F31<0,0.5,0)),IF($BH32,IF($AY32>$AY33,-0.5,IF($AY32<$AY33,0.5,0)),IF($BI32,IF($AZ32>$AZ33,-0.5, IF($AZ32<$AZ33,0.5,0)),0)))","v":0},{"$f":"IF($BM32,IF(F33-E33<0,-0.5,IF(E33-F33<0,0.5,0)),IF($BH32,IF($AY32>$AY34,-0.5,IF($AY32<$AY34,0.5,0)),IF($BJ32,IF($BA32>$BA34,-0.5,IF($BA32<$BA34,0.5,0)),0)))","v":0},{"$f":"IF($BN32,IF(E35-F35<0,-0.5,IF(F35-E35<0,0.5,0)),IF($BI32,IF($AZ32>$AZ35,-0.5,IF($AZ32<$AZ35,0.5,0)),IF($BJ32,IF($BA32>$BA35,-0.5, IF($BA32<$BA35,0.5,0)),0)))","v":0},"x",{"$f":"IF(ISBLANK(E31),0,IF(AR32=0,0.5,IF(AR32=3,-0.5,0)))","v":0},{"$f":"IF(ISBLANK(E33),0,IF(AS32=0,0.5,IF(AS32=3,-0.5,0)))","v":-0.5},{"$f":"IF(ISBLANK(F35),0,IF(AT32=0,0.5,IF(AT32=3,-0.5,0)))","v":0},null,"x",{"$f":"IF(100*AP32+AN32>=MAX(100*AP35+AN35,100*AP34+AN34),-0.5, 0.5)","v":-0.5},{"$f":"IF(100*AP32+AN32>=MAX(100*AP33+AN33,100*AP35+AN35),-0.5, 0.5)","v":-0.5},{"$f":"IF(100*AP32+AN32>=MAX(100*AP33+AN33,100*AP34+AN34),-0.5, 0.5)","v":-0.5},{"$f":"AND(AM32=AM33,AM33=AM34,AM34=AM35)","v":false},{"$f":"IF(AND(NOT(CF32),AM32=AM33,AM32=AM34),1,0)","v":0},{"$f":"IF(AND(NOT(CF32),AM32=AM33,AM32=AM35),1,0)","v":0},{"$f":"IF(AND(NOT(CF32),AM32=AM34,AM32=AM35),1,0)","v":0},{"$f":"IF(AND(NOT(CF32),AM33=AM34,AM33=AM35),1,0)","v":0},{"$f":"IF(OR(CH32,CI32,CJ32),1,0)","v":0}]
[null,"2012-06-15","18:00:00",{"$f":"D31","v":"France"},2,0,{"$f":"D32","v":"Ukraine"},null,{"$f":"AH33","v":2},{"$f":"INDEX(AL32:AL35,MATCH(AJ33,$AK32:$AK35,0))","v":"Angleterre"},{"$f":"INDEX(AM32:AM35,MATCH(AJ33,$AK32:$AK35,0))","v":4},{"$f":"INDEX(AN32:AN35,MATCH(AJ33,$AK32:$AK35,0))","v":4},{"$f":"INDEX(AO32:AO35,MATCH(AJ33,$AK32:$AK35,0))","v":3},{"$f":"INDEX(AP32:AP35,MATCH(AJ33,$AK32:$AK35,0))","v":1},null,null,null,null,null,null,null,null,null,null,null,null,null,null,null,null,null,null,null,{"$f":"IF(ROUND(AJ33,0)=ROUND(AJ32,0),AH32,2)","v":2},{"$f":"ROUND(AJ33,0)","v":2},{"$f":"MAX(MIN(AK32:AK34),MIN(AK32,AK33,AK35),MIN(AK32,AK34,AK35),MIN(AK33:AK35))","v":1.96},{"$f":"SUM(BC33:BF33)+2.46","v":1.96},{"$f":"G31","v":"Angleterre"},{"$f":"SUM(AQ33:AT33)","v":4},{"$f":"F31+F34+E36","v":4},{"$f":"E31+E34+F36","v":3},{"$f":"AN33-AO33","v":1},{"$f":"IF(ISBLANK(F31),0,IF(AR32=3,0,IF(AR32=1,1,3)))","v":1},"x",{"$f":"IF(ISBLANK(E36),0,IF(AR34=3,0,IF(AR34=1,1,3)))","v":0},{"$f":"IF(ISBLANK(F34),0,IF(F34>E34,3,IF(F34=E34,1,0)))","v":3},{"$f":"(10*(AP32-AP33)+AN32-AN33<0)","v":false},"x",{"$f":"10*(AP33-AP34)+AN33-AN34>0","v":true},{"$f":"10*(AP33-AP35)+AN33-AN35>0","v":true},{"$f":"10000*(AQ33+AS33)+(F31-E31+E36-F36)*100+(F31+E36)","v":10001},{"$f":"10000*(AQ33+AT33)+(F31-E31+F34-E34)*100+(F31+F34)","v":40104},"x",{"$f":"10000*(AS33+AT33)+(F34-E34+E36-F36)*100+(F34+E36)","v":30103},{"$f":"IF($AM32>$AM33,0.5,IF($AM33>$AM32,-0.5,IF(CK32=1,CB33,IF(BW33<>0,BW33,IF(AV32,0.5,IF(AU33,-0.5,BT32))))))","v":0.5},"x",{"$f":"IF($AM33>$AM34,-0.5,IF($AM34>$AM33,0.5,IF(CK32=1,CD33,IF(BY33<>0,BY33,IF(AW33,-0.5,IF(AV34,0.5,BU33))))))","v":-0.5},{"$f":"IF($AM33>$AM35,-0.5,IF($AM35>$AM33,0.5,IF(CK32=1,CE33,IF(BZ33<>0,BZ33,IF(AX33,-0.5,IF(AV35,0.5,BV33))))))","v":-0.5},null,null,null,null,null,null,null,null,null,null,null,null,null,"x",{"$f":"IF($BO32,IF(F36-E36<0,-0.5,IF(E36-F36<0,0.5,0)),IF($BH32,IF($AY33>$AY34,-0.5,IF($AY33<$AY34,0.5,0)),IF($BK32,IF($BB33>$BB34,-0.5,IF($BB33<$BB34,0.5,0)),0)))","v":0},{"$f":"IF($BP32,IF(E34-F34<0,-0.5,IF(F34-E34<0,0.5,0)),IF($BI32,IF($AZ33>$AZ35,-0.5,IF($AZ33<$AZ35,0.5,0)),IF($BK32,IF($BB33>$BB35,-0.5,IF($BB33<$BB35,0.5,0)),0)))","v":0},{"$f":"-BX32","v":0},"x",{"$f":"IF(ISBLANK(E36),0,IF(AS33=0,0.5,IF(AS33=3,-0.5,0)))","v":0},{"$f":"IF(ISBLANK(F34),0,IF(AT33=0,0.5,IF(AT33=3,-0.5,0)))","v":-0.5},null,{"$f":"IF(100*AP33+AN33>=MAX(100*AP34+AN34,100*AP35+AN35),-0.5, 0.5)","v":-0.5},"x",{"$f":"IF(100*AP33+AN33>=MAX(100*AP32+AN32,100*AP35+AN35),-0.5, 0.5)","v":0.5},{"$f":"IF(100*AP33+AN33>=MAX(100*AP34+AN34,100*AP32+AN32),-0.5, 0.5)","v":0.5}]
[null,"2012-06-15","20:45:00",{"$f":"G32","v":"Suède"},2,3,{"$f":"G31","v":"Angleterre"},null,{"$f":"AH34","v":3},{"$f":"INDEX(AL32:AL35,MATCH(AJ34,$AK32:$AK35,0))","v":"Ukraine"},{"$f":"INDEX(AM32:AM35,MATCH(AJ34,$AK32:$AK35,0))","v":3},{"$f":"INDEX(AN32:AN35,MATCH(AJ34,$AK32:$AK35,0))","v":2},{"$f":"INDEX(AO32:AO35,MATCH(AJ34,$AK32:$AK35,0))","v":3},{"$f":"INDEX(AP32:AP35,MATCH(AJ34,$AK32:$AK35,0))","v":-1},null,null,null,null,null,null,null,null,null,null,null,null,null,null,null,null,null,null,null,{"$f":"IF(ROUND(AJ34,0)=ROUND(AJ33,0),AH33,3)","v":3},{"$f":"ROUND(AJ34,0)","v":3},{"$f":"MIN(MAX(AK32:AK34),MAX(AK32,AK33,AK35),MAX(AK32,AK34,AK35),MAX(AK33:AK35))","v":2.97},{"$f":"SUM(BC34:BF34)+2.47","v":2.97},{"$f":"D32","v":"Ukraine"},{"$f":"SUM(AQ34:AT34)","v":3},{"$f":"E32+F33+F36","v":2},{"$f":"F32+E33+E36","v":3},{"$f":"AN34-AO34","v":-1},{"$f":"IF(ISBLANK(F33),0,IF(AS32=3,0,IF(AS32=1,1,3)))","v":0},{"$f":"IF(ISBLANK(F36),0,IF(F36>E36,3,IF(F36=E36,1,0)))","v":0},"x",{"$f":"IF(ISBLANK(E32),0,IF(E32>F32,3,IF(E32=F32,1,0)))","v":3},{"$f":"10*(AP32-AP34)+AN32-AN34<0","v":false},{"$f":"10*(AP33-AP34)+AN33-AN34<0","v":false},"x",{"$f":"10*(AP34-AP35)+AN34-AN35>0","v":true},{"$f":"10000*(AQ34+AR34)+(F33-E33+F36-E36)*100+(F33+F36)","v":-200},"x",{"$f":"10000*(AQ34+AT34)+(E32-F32+F33-E33)*100+(E32+F33)","v":29902},{"$f":"10000*(AR34+AT34)+(E32-F32+F36-E36)*100+(E32+F36)","v":30102},{"$f":"IF($AM32>$AM34,0.5,IF($AM34>$AM32,-0.5,IF(CK32=1,CB34,IF(BW34<>0,BW34,IF(AW32,0.5,IF(AU34,-0.5,BU32))))))","v":0.5},{"$f":"IF($AM33>$AM34,0.5,IF($AM34>$AM33,-0.5,IF(CK32=1,CC34,IF(BX34<>0,BX34,IF(AW33,0.5,IF(AV34,-0.5,BU33))))))","v":0.5},"x",{"$f":"IF($AM34>$AM35,-0.5,IF($AM35>$AM34,0.5,IF(CK32=1,CE34,IF(BZ34<>0,BZ34,IF(AX34,-0.5,IF(AW35,0.5,BV34))))))","v":-0.5},null,null,null,null,null,null,null,null,null,null,null,null,null,null,"x",{"$f":"IF($BQ32,IF(F32-E32<0,-0.5,IF(E32-F32<0,0.5,0)),IF($BJ32,IF($BA34>$BA35,-0.5,IF($BA34<$BA35,0.5,0)),IF($BK32,IF($BB34>$BB35,-0.5,IF($BB34<$BB35,0.5,0)),0)))","v":0},{"$f":"-BY32","v":0.5},{"$f":"-BY33","v":0},"x",{"$f":"IF(ISBLANK(E32),0,IF(AT34=0,0.5,IF(AT34=3,-0.5,0)))","v":-0.5},null,{"$f":"IF(100*AP34+AN34>=MAX(100*AP35+AN35,100*AP33+AN33),-0.5, 0.5)","v":0.5},{"$f":"IF(100*AP34+AN34>=MAX(100*AP32+AN32,100*AP33+AN33),-0.5, 0.5)","v":0.5},"x",{"$f":"IF(100*AP34+AN34>=MAX(100*AP32+AN32,100*AP33+AN33),-0.5, 0.5)","v":0.5}]
[null,"2012-06-19","20:45:00",{"$f":"G32","v":"Suède"},null,null,{"$f":"D31","v":"France"},null,{"$f":"AH35","v":4},{"$f":"INDEX(AL32:AL35,MATCH(AJ35,$AK32:$AK35,0))","v":"Suède"},{"$f":"INDEX(AM32:AM35,MATCH(AJ35,$AK32:$AK35,0))","v":0},{"$f":"INDEX(AN32:AN35,MATCH(AJ35,$AK32:$AK35,0))","v":3},{"$f":"INDEX(AO32:AO35,MATCH(AJ35,$AK32:$AK35,0))","v":5},{"$f":"INDEX(AP32:AP35,MATCH(AJ35,$AK32:$AK35,0))","v":-2},null,null,null,null,null,null,null,null,null,null,null,null,null,null,null,null,null,null,null,{"$f":"IF(ROUND(AJ35,0)=ROUND(AJ34,0),AH34,4)","v":4},{"$f":"ROUND(AJ35,0)","v":4},{"$f":"MAX(AK32:AK35)","v":3.98},{"$f":"SUM(BC35:BF35)+2.48","v":3.98},{"$f":"G32","v":"Suède"},{"$f":"SUM(AQ35:AT35)","v":0},{"$f":"F32+E34+E35","v":3},{"$f":"E32+F34+F35","v":5},{"$f":"AN35-AO35","v":-2},{"$f":"IF(ISBLANK(E35),0,IF(AT32=3,0,IF(AT32=1,1,3)))","v":0},{"$f":"IF(ISBLANK(E34),0,IF(AT33=3,0,IF(AT33=1,1,3)))","v":0},{"$f":"IF(ISBLANK(F32),0,IF(AT34=3,0,IF(AT34=1,1,3)))","v":0},"x",{"$f":"10*(AP32-AP35)+AN32-AN35<0","v":false},{"$f":"10*(AP33-AP35)+AN33-AN35<0","v":false},{"$f":"10*(AP34-AP35)+AN34-AN35<0","v":false},"x","x",{"$f":"10000*(AQ35+AR35)+(E34-F34+E35-F35)*100+(E34+E35)","v":-98},{"$f":"10000*(AQ35+AS35)+(E35-F35+F32-E32)*100+(E35+F32)","v":-99},{"$f":"10000*(AR35+AS35)+(E34-F34+F32-E32)*100+(E34+F32)","v":-197},{"$f":"IF($AM32>$AM35,0.5,IF($AM35>$AM32,-0.5,IF(CK32=1,CB35,IF(BW35<>0,BW35,IF(AX32,0.5,IF(AU35,-0.5,BV32))))))","v":0.5},{"$f":"IF($AM33>$AM35,0.5,IF($AM35>$AM33,-0.5,IF(CK32=1,BX35,IF(BX35<>0,BX35,IF(AX33,0.5,IF(AV35,-0.5,BV33))))))","v":0.5},{"$f":"IF($AM34>$AM35,0.5,IF($AM35>$AM34,-0.5,IF(CK32=1,CD35,IF(BY35<>0,BY35,IF(AX34,0.5,IF(AW35,-0.5,BV34))))))","v":0.5},"x",null,null,null,null,null,null,null,null,null,null,null,null,null,null,null,"x",{"$f":"-BZ32","v":0},{"$f":"-BZ33","v":0.5},{"$f":"-BZ34","v":0.5},"x",null,{"$f":"IF(100*AP35+AN35>=MAX(100*AP33+AN33,100*AP34+AN34),-0.5, 0.5)","v":0.5},{"$f":"IF(100*AP35+AN35>=MAX(100*AP32+AN32,100*AP34+AN34),-0.5, 0.5)","v":0.5},{"$f":"IF(100*AP35+AN35>=MAX(100*AP32+AN32,100*AP33+AN33),-0.5, 0.5)","v":0.5},"x"]
[null,"2012-06-19","20:45:00",{"$f":"G31","v":"Angleterre"},null,null,{"$f":"D32","v":"Ukraine"},null,null,{"$f":"IF(OR(I34<3,I33<2),Data!T27,\" \")","v":" "}]

{"sheet":"Pronostics","index":2,"n_rows":118,"n_cols":65,"rows_kept":118,"cut":false,"hidden":false,"merged":[[2,2,3,59],[6,0,6,63],[7,4,7,59],[9,4,9,11],[9,24,9,31],[9,44,9,51],[11,4,11,6],[11,8,11,10],[11,14,11,16],[11,18,11,20],[11,24,11,26],[11,58,11,60],[11,28,11,30],[11,34,11,36],[11,38,11,40],[11,44,11,46],[11,48,11,50],[11,54,11,56],[12,48,12,50],[12,54,12,56],[12,58,12,60],[13,4,13,6],[13,8,13,10],[13,14,13,16],[13,18,13,20],[13,24,13,26],[13,28,13,30],[13,34,13,36],[12,4,12,6],[12,8,12,10],[12,14,12,16],[12,18,12,20],[12,24,12,26],[12,28,12,30],[12,34,12,36],[12,38,12,40],[12,44,12,46],[14,54,14,60],[15,2,21,2],[15,3,21,3],[15,13,21,13],[15,22,21,22],[15,33,21,33],[15,42,21,42],[15,53,21,53],[13,38,13,40],[13,44,13,46],[13,48,13,50],[13,54,13,56],[13,58,13,60],[14,4,14,10],[14,14,14,20],[14,24,14,30],[14,34,14,40],[14,44,14,50],[27,34,27,36],[27,38,27,40],[27,44,27,46],[27,48,27,50],[27,54,27,56],[27,58,27,60],[23,4,23,59],[25,4,25,11],[25,24,25,31],[25,44,25,51],[27,4,27,6],[27,8,27,10],[27,14,27,16],[27,18,27,20],[27,24,27,26],[27,28,27,30],[28,34,28,36],[28,38,28,40],[28,44,28,46],[28,48,28,50],[28,54,28,56],[28,58,28,60],[28,4,28,6],[28,8,28,10],[28,14,28,16],[28,18,28,20],[28,24,28,26],[28,28,28,30],[30,54,30,60],[29,34,29,36],[29,38,29,40],[29,44,29,46],[29,48,29,50],[29,54,29,56],[29,58,29,60],[29,4,29,6],[29,8,29,10],[29,14,29,16],[29,18,29,20],[29,24,29,26],[29,28,29,30],[31,2,37,2],[31,13,37,13],[31,22,37,22],[31,33,37,33],[31,42,37,42],[31,53,37,53],[30,4,30,10],[30,14,30,20],[30,24,30,30],[30,34,30,40],[30,44,30,50],[43,34,43,36],[43,38,43,40],[43,44,43,46],[43,48,43,50],[43,54,43,56],[43,58,43,60],[39,4,39,59],[41,4,41,11],[41,24,41,31],[41,44,41,51],[43,4,43,6],[43,8,43,10],[43,14,43,16],[43,18,43,20],[43,24,43,26],[43,28,43,30],[44,34,44,36],[44,38,44,40],[44,44,44,46],[44,48,44,50],[44,54,44,56],[44,58,44,60],[44,4,44,6],[44,8,44,10],[44,14,44,16],[44,18,44,20],[44,24,44,26],[44,28,44,30],[46,54,46,60],[45,34,45,36],[45,38,45,40],[45,44,45,46],[45,48,45,50],[45,54,45,56],[45,58,45,60],[45,4,45,6],[45,8,45,10],[45,14,45,16],[45,18,45,20],[45,24,45,26],[45,28,45,30],[47,2,53,2],[47,13,53,13],[47,22,53,22],[47,33,53,33],[47,42,53,42],[47,53,53,53],[46,4,46,10],[46,14,46,20],[46,24,46,30],[46,34,46,40],[46,44,46,50],[59,34,59,36],[59,38,59,40],[59,44,59,46],[59,48,59,50],[59,54,59,56],[59,58,59,60],[55,4,55,59],[57,4,57,11],[57,24,57,31],[57,44,57,51],[59,4,59,6],[59,8,59,10],[59,14,59,16],[59,18,59,20],[59,24,59,26],[59,28,59,30],[60,34,60,36],[60,38,60,40],[60,44,60,46],[60,48,60,50],[60,54,60,56],[60,58,60,60],[60,4,60,6],[60,8,60,10],[60,14,60,16],[60,18,60,20],[60,24,60,26],[60,28,60,30],[62,54,62,60],[61,34,61,36],[61,38,61,40],[61,44,61,46],[61,48,61,50],[61,54,61,56],[61,58,61,60],[61,4,61,6],[61,8,61,10],[61,14,61,16],[61,18,61,20],[61,24,61,26],[61,28,61,30],[63,2,69,2],[63,13,69,13],[63,22,69,22],[63,33,69,33],[63,42,69,42],[63,53,69,53],[62,4,62,10],[62,14,62,20],[62,24,62,30],[62,34,62,40],[62,44,62,50],[79,2,85,2],[79,13,85,13],[73,14,73,21],[73,4,73,11],[75,4,75,6],[75,8,75,10],[75,14,75,16],[75,18,75,20],[76,4,76,6],[76,8,76,10],[76,14,76,16],[76,18,76,20],[75,28,75,30],[76,24,76,26],[76,28,76,30],[77,4,77,6],[77,8,77,10],[77,14,77,16],[77,18,77,20],[78,4,78,10],[78,14,78,20],[95,2,101,2],[95,13,101,13],[105,4,105,11],[107,4,107,6],[107,8,107,10],[91,4,91,6],[91,8,91,10],[91,14,91,16],[91,18,91,20],[92,4,92,6],[92,8,92,10],[92,14,92,16],[92,18,92,20],[93,4,93,6],[93,8,93,10],[93,14,93,16],[93,18,93,20],[79,33,85,33],[111,3,117,3],[111,13,117,13],[71,4,71,11],[71,14,71,21],[71,24,71,31],[87,4,87,11],[87,14,87,21],[103,4,103,11],[108,4,108,6],[108,8,108,10],[109,4,109,6],[109,8,109,10],[110,4,110,10],[94,4,94,10],[94,14,94,20],[77,24,77,26],[77,28,77,30],[78,24,78,30],[79,22,85,22],[89,4,89,11],[89,14,89,21],[73,24,73,31],[75,24,75,26],[73,34,73,41],[71,34,71,41],[75,34,75,36],[75,38,75,40],[76,34,76,36],[76,38,76,40],[77,34,77,36],[77,38,77,40],[78,34,78,40]]}
[]
[]
[null,null,{"$f":"Data!T53","v":"Les Pronostics"}]
[null,null,null,null,null,null,null,null,null,null,null,null,null,null,null,null,null,null,null,null,null,null,null,null,null,null,null,null,null,null,null,null,null,null,null,null,null,null,null,null,null,null,null,null,null,null,null,null,null,null,null,null,null,null,null,null,null,null,null,null,null,null,null,"2012-06-09","2012-06-10"]
[null,null,null,null,null,null,null,null,null,null,null,null,null,null,null,null,null,null,null,null,null,null,null,null,null,null,null,null,null,null,null,null,null,null,null,null,null,null,null,null,null,null,null,null,null,null,null,null,null,null,null,null,null,null,null,null,null,null,null,null,null,null,"Users",1932,{"$f":"Scores!AB9","v":2757}]
[null,null,null,null,null,null,null,null,null,null,null,null,null,null,null,null,null,null,null,null,null,null,null,null,null,null,null,null,null,null,null,null,null,null,null,null,null,null,null,null,null,null,null,null,null,null,null,null,null,null,null,null,null,null,null,null,null,null,null,null,null,null,"Bets",25918,{"$f":"SUM(BL22:BL119)","v":31874}]
[]
[null,null,null,null,"Groupe A",null,null,null,null,null,null,null,null,null,null,null,null,null,null,null,null,null,null,null,null,null,null,null,null,null,null,null,null,null,null,null,null,null,null,null,null,null,null,null,null,null,null,null,null,null,null,null,null,null,null,null,null,null,null,null,null,null,null,{"$f":"BL6/BL5","v":13.415113871635612},{"$f":"BM6/BM5","v":11.561117156329344}]
[]
[null,null,null,1,{"$f":"VLOOKUP(D10,Data!$B$2:$J$33,7,FALSE)","v":"2012-06-08T18:00:00"},null,null,null,null,null,null,null,null,null,null,null,null,null,null,null,null,null,null,3,{"$f":"VLOOKUP(X10,Data!$B$2:$J$33,7,FALSE)","v":"2012-06-12T18:00:00"},null,null,null,null,null,null,null,null,null,null,null,null,null,null,null,null,null,null,5,{"$f":"VLOOKUP(AR10,Data!$B$2:$J$33,7,FALSE)","v":"2012-06-16T20:45:00"}]
[]
[null,null,null,1,{"$f":"VLOOKUP(D12,Data!$B$2:$J$33,5,FALSE)","v":"Pologne"},null,null,"vs",{"$f":"VLOOKUP(D12,Data!$B$2:$J$33,6,FALSE)","v":"Grèce"},null,null,null,null,null,{"$f":"VLOOKUP(D13,Data!$B$2:$J$33,5,FALSE)","v":"Russie"},null,null,"vs",{"$f":"VLOOKUP(D13,Data!$B$2:$J$33,6,FALSE)","v":"Rép.Tchèque"},null,null,null,null,3,{"$f":"VLOOKUP(X12,Data!$B$2:$J$33,5,FALSE)","v":"Grèce"},null,null,"vs",{"$f":"VLOOKUP(X12,Data!$B$2:$J$33,6,FALSE)","v":"Rép.Tchèque"},null,null,null,null,null,{"$f":"VLOOKUP(X13,Data!$B$2:$J$33,5,FALSE)","v":"Pologne"},null,null,"vs",{"$f":"VLOOKUP(X13,Data!$B$2:$J$33,6,FALSE)","v":"Russie"},null,null,null,null,5,{"$f":"VLOOKUP(AR12,Data!$B$2:$J$33,5,FALSE)","v":"Grèce"},null,null,"vs",{"$f":"VLOOKUP(AR12,Data!$B$2:$J$33,6,FALSE)","v":"Russie"},null,null,null,null,null,{"$f":"VLOOKUP(AR13,Data!$B$2:$J$33,5,FALSE)","v":"Rép.Tchèque"},null,null,"vs",{"$f":"VLOOKUP(AR13,Data!$B$2:$J$33,6,FALSE)","v":"Pologne"}]
[null,null,null,2,{"$f":"VLOOKUP(D12,Data!$B$2:$J$33,2,FALSE)","v":1},null,null,{"$f":"Data!T52","v":"à"},{"$f":"VLOOKUP(D12,Data!$B$2:$J$33,3,FALSE)","v":1},null,null,null,null,null,{"$f":"VLOOKUP(D13,Data!$B$2:$J$33,2,FALSE)","v":4},null,null,{"$f":"H13","v":"à"},{"$f":"VLOOKUP(D13,Data!$B$2:$J$33,3,FALSE)","v":1},null,null,null,null,4,{"$f":"VLOOKUP(X12,Data!$B$2:$J$33,2,FALSE)","v":1},null,null,{"$f":"H13","v":"à"},{"$f":"VLOOKUP(X12,Data!$B$2:$J$33,3,FALSE)","v":2},null,null,null,null,null,{"$f":"VLOOKUP(X13,Data!$B$2:$J$33,2,FALSE)","v":1},null,null,{"$f":"H13","v":"à"},{"$f":"VLOOKUP(X13,Data!$B$2:$J$33,3,FALSE)","v":1},null,null,null,null,6,{"$f":"VLOOKUP(AR12,Data!$B$2:$J$33,2,FALSE)","v":1},null,null,{"$f":"H13","v":"à"},{"$f":"VLOOKUP(AR12,Data!$B$2:$J$33,3,FALSE)","v":0},null,null,null,null,null,{"$f":"VLOOKUP(AR13,Data!$B$2:$J$33,2,FALSE)","v":1},null,null,{"$f":"H13","v":"à"},{"$f":"VLOOKUP(AR13,Data!$B$2:$J$33,3,FALSE)","v":0}]
[null,null,null,null,{"$f":"ROUND((SUM(G17:G22)*G16+SUM(H17:H22)*H16+SUM(I17:I22)*I16+SUM(J17:J22)*J16+SUM(K17:K22)*5)/IF(SUM(F17:K22)=0,1,SUM(F17:K22)),2)","v":1.29},null,null,null,{"$f":"ROUND((SUM(F18:K18)*E18+SUM(F19:K19)*E19+SUM(F20:K20)*E20+SUM(F21:K21)*E21++SUM(F22:K22)*5)/IF(SUM(F17:K22)=0,1,SUM(F17:K22)),2)","v":0.6},null,null,null,null,null,{"$f":"ROUND((SUM(Q17:Q22)*Q16+SUM(R17:R22)*R16+SUM(S17:S22)*S16+SUM(T17:T22)*T16+SUM(U17:U22)*5)/IF(SUM(P17:U22)=0,1,SUM(P17:U22)),2)","v":1.4},null,null,null,{"$f":"ROUND((SUM(P18:U18)*O18+SUM(P19:U19)*O19+SUM(P20:U20)*O20+SUM(P21:U21)*O21++SUM(P22:U22)*5)/IF(SUM(P17:U22)=0,1,SUM(P17:U22)),2)","v":1.02},null,null,null,null,null,{"$f":"ROUND((SUM(AA17:AA22)*AA16+SUM(AB17:AB22)*AB16+SUM(AC17:AC22)*AC16+SUM(AD17:AD22)*AD16+SUM(AE17:AE22)*5)/IF(SUM(Z17:AE22)=0,1,SUM(Z17:AE22)),2)","v":0.65},null,null,null,{"$f":"ROUND((SUM(Z18:AE18)*Y18+SUM(Z19:AE19)*Y19+SUM(Z20:AE20)*Y20+SUM(Z21:AE21)*Y21++SUM(Z22:AE22)*5)/IF(SUM(Z17:AE22)=0,1,SUM(Z17:AE22)),2)","v":1.38},null,null,null,null,null,{"$f":"ROUND((SUM(AK17:AK22)*AK16+SUM(AL17:AL22)*AL16+SUM(AM17:AM22)*AM16+SUM(AN17:AN22)*AN16+SUM(AO17:AO22)*5)/IF(SUM(AJ17:AO22)=0,1,SUM(AJ17:AO22)),2)","v":0.82},null,null,null,{"$f":"ROUND((SUM(AJ18:AO18)*AI18+SUM(AJ19:AO19)*AI19+SUM(AJ20:AO20)*AI20+SUM(AJ21:AO21)*AI21++SUM(AJ22:AO22)*5)/IF(SUM(AJ17:AO22)=0,1,SUM(AJ17:AO22)),2)","v":1.28},null,null,null,null,null,{"$f":"ROUND((SUM(AU17:AU22)*AU16+SUM(AV17:AV22)*AV16+SUM(AW17:AW22)*AW16+SUM(AX17:AX22)*AX16+SUM(AY17:AY22)*5)/IF(SUM(AT17:AY22)=0,1,SUM(AT17:AY22)),2)","v":0.65},null,null,null,{"$f":"ROUND((SUM(AT18:AY18)*AS18+SUM(AT19:AY19)*AS19+SUM(AT20:AY20)*AS20+SUM(AT21:AY21)*AS21++SUM(AT22:AY22)*5)/IF(SUM(AT17:AY22)=0,1,SUM(AT17:AY22)),2)","v":1.61},null,null,null,null,null,{"$f":"ROUND((SUM(BE17:BE22)*BE16+SUM(BF17:BF22)*BF16+SUM(BG17:BG22)*BG16+SUM(BH17:BH22)*BH16+SUM(BI17:BI22)*5)/IF(SUM(BD17:BI22)=0,1,SUM(BD17:BI22)),2)","v":1.1299999999999999},null,null,null,{"$f":"ROUND((SUM(BD18:BI18)*BC18+SUM(BD19:BI19)*BC19+SUM(BD20:BI20)*BC20+SUM(BD21:BI21)*BC21++SUM(BD22:BI22)*5)/IF(SUM(BD17:BI22)=0,1,SUM(BD17:BI22)),2)","v":1.03}]
[null,null,null,null,{"$f":"E12","v":"Pologne"},null,null,null,null,null,null,null,null,null,{"$f":"O12","v":"Russie"},null,null,null,null,null,null,null,null,null,{"$f":"Y12","v":"Grèce"},null,null,null,null,null,null,null,null,null,{"$f":"AI12","v":"Pologne"},null,null,null,null,null,null,null,null,null,{"$f":"AS12","v":"Grèce"},null,null,null,null,null,null,null,null,null,{"$f":"BC12","v":"Rép.Tchèque"}]
[null,null,{"$f":"I12","v":"Grèce"},null,null,0,1,2,3,4,"4+",null,null,{"$f":"S12","v":"Rép.Tchèque"},null,0,1,2,3,4,"4+",null,{"$f":"AC12","v":"Rép.Tchèque"},null,null,0,1,2,3,4,"4+",null,null,{"$f":"AM12","v":"Russie"},null,0,1,2,3,4,"4+",null,{"$f":"AW12","v":"Russie"},null,null,0,1,2,3,4,"4+",null,null,{"$f":"BG12","v":"Pologne"},null,0,1,2,3,4,"4+"]
[null,null,null,null,0,{"$f":"VLOOKUP(D12,Data!$W$2:$BG$33,2,FALSE)","v":47},{"$f":"VLOOKUP(D12,Data!$W$2:$BG$33,8,FALSE)","v":331},{"$f":"VLOOKUP(D12,Data!$W$2:$BG$33,14,FALSE)","v":140},{"$f":"VLOOKUP(D12,Data!$W$2:$BG$33,20,FALSE)","v":11},{"$f":"VLOOKUP(D12,Data!$W$2:$BG$33,26,FALSE)","v":1},{"$f":"VLOOKUP(D12,Data!$W$2:$BG$33,32,FALSE)","v":3},null,null,null,0,{"$f":"VLOOKUP(D13,Data!$W$2:$BG$33,2,FALSE)","v":22},{"$f":"VLOOKUP(D13,Data!$W$2:$BG$33,8,FALSE)","v":130},{"$f":"VLOOKUP(D13,Data!$W$2:$BG$33,14,FALSE)","v":96},{"$f":"VLOOKUP(D13,Data!$W$2:$BG$33,20,FALSE)","v":10},{"$f":"VLOOKUP(D13,Data!$W$2:$BG$33,26,FALSE)","v":0},{"$f":"VLOOKUP(D13,Data!$W$2:$BG$33,32,FALSE)","v":1},null,null,null,0,{"$f":"VLOOKUP(X12,Data!$W$2:$BG$33,2,FALSE)","v":90},{"$f":"VLOOKUP(X12,Data!$W$2:$BG$33,8,FALSE)","v":74},{"$f":"VLOOKUP(X12,Data!$W$2:$BG$33,14,FALSE)","v":22},{"$f":"VLOOKUP(X12,Data!$W$2:$BG$33,20,FALSE)","v":6},{"$f":"VLOOKUP(X12,Data!$W$2:$BG$33,26,FALSE)","v":2},{"$f":"VLOOKUP(X12,Data!$W$2:$BG$33,32,FALSE)","v":0},null,null,null,0,{"$f":"VLOOKUP(X13,Data!$W$2:$BG$33,2,FALSE)","v":93},{"$f":"VLOOKUP(X13,Data!$W$2:$BG$33,8,FALSE)","v":85},{"$f":"VLOOKUP(X13,Data!$W$2:$BG$33,14,FALSE)","v":19},{"$f":"VLOOKUP(X13,Data!$W$2:$BG$33,20,FALSE)","v":2},{"$f":"VLOOKUP(X13,Data!$W$2:$BG$33,26,FALSE)","v":0},{"$f":"VLOOKUP(X13,Data!$W$2:$BG$33,32,FALSE)","v":0},null,null,null,0,{"$f":"VLOOKUP(AR12,Data!$W$2:$BG$33,2,FALSE)","v":71},{"$f":"VLOOKUP(AR12,Data!$W$2:$BG$33,8,FALSE)","v":68},{"$f":"VLOOKUP(AR12,Data!$W$2:$BG$33,14,FALSE)","v":24},{"$f":"VLOOKUP(AR12,Data!$W$2:$BG$33,20,FALSE)","v":3},{"$f":"VLOOKUP(AR12,Data!$W$2:$BG$33,26,FALSE)","v":3},{"$f":"VLOOKUP(AR12,Data!$W$2:$BG$33,32,FALSE)","v":1},null,null,null,0,{"$f":"VLOOKUP(AR13,Data!$W$2:$BG$33,2,FALSE)","v":95},{"$f":"VLOOKUP(AR13,Data!$W$2:$BG$33,8,FALSE)","v":134},{"$f":"VLOOKUP(AR13,Data!$W$2:$BG$33,14,FALSE)","v":63},{"$f":"VLOOKUP(AR13,Data!$W$2:$BG$33,20,FALSE)","v":18},{"$f":"VLOOKUP(AR13,Data!$W$2:$BG$33,26,FALSE)","v":1},{"$f":"VLOOKUP(AR13,Data!$W$2:$BG$33,32,FALSE)","v":0}]
[null,null,null,null,1,{"$f":"VLOOKUP(D12,Data!$W$2:$BG$33,3,FALSE)","v":50},{"$f":"VLOOKUP(D12,Data!$W$2:$BG$33,9,FALSE)","v":156},{"$f":"VLOOKUP(D12,Data!$W$2:$BG$33,15,FALSE)","v":172},{"$f":"VLOOKUP(D12,Data!$W$2:$BG$33,21,FALSE)","v":11},{"$f":"VLOOKUP(D12,Data!$W$2:$BG$33,27,FALSE)","v":3},{"$f":"VLOOKUP(D12,Data!$W$2:$BG$33,33,FALSE)","v":0},null,null,null,1,{"$f":"VLOOKUP(D13,Data!$W$2:$BG$33,3,FALSE)","v":55},{"$f":"VLOOKUP(D13,Data!$W$2:$BG$33,9,FALSE)","v":190},{"$f":"VLOOKUP(D13,Data!$W$2:$BG$33,15,FALSE)","v":205},{"$f":"VLOOKUP(D13,Data!$W$2:$BG$33,21,FALSE)","v":40},{"$f":"VLOOKUP(D13,Data!$W$2:$BG$33,27,FALSE)","v":8},{"$f":"VLOOKUP(D13,Data!$W$2:$BG$33,33,FALSE)","v":0},null,null,null,1,{"$f":"VLOOKUP(X12,Data!$W$2:$BG$33,3,FALSE)","v":220},{"$f":"VLOOKUP(X12,Data!$W$2:$BG$33,9,FALSE)","v":140},{"$f":"VLOOKUP(X12,Data!$W$2:$BG$33,15,FALSE)","v":41},{"$f":"VLOOKUP(X12,Data!$W$2:$BG$33,21,FALSE)","v":8},{"$f":"VLOOKUP(X12,Data!$W$2:$BG$33,27,FALSE)","v":1},{"$f":"VLOOKUP(X12,Data!$W$2:$BG$33,33,FALSE)","v":1},null,null,null,1,{"$f":"VLOOKUP(X13,Data!$W$2:$BG$33,3,FALSE)","v":139},{"$f":"VLOOKUP(X13,Data!$W$2:$BG$33,9,FALSE)","v":282},{"$f":"VLOOKUP(X13,Data!$W$2:$BG$33,15,FALSE)","v":59},{"$f":"VLOOKUP(X13,Data!$W$2:$BG$33,21,FALSE)","v":9},{"$f":"VLOOKUP(X13,Data!$W$2:$BG$33,27,FALSE)","v":1},{"$f":"VLOOKUP(X13,Data!$W$2:$BG$33,33,FALSE)","v":0},null,null,null,1,{"$f":"VLOOKUP(AR12,Data!$W$2:$BG$33,3,FALSE)","v":160},{"$f":"VLOOKUP(AR12,Data!$W$2:$BG$33,9,FALSE)","v":136},{"$f":"VLOOKUP(AR12,Data!$W$2:$BG$33,15,FALSE)","v":33},{"$f":"VLOOKUP(AR12,Data!$W$2:$BG$33,21,FALSE)","v":6},{"$f":"VLOOKUP(AR12,Data!$W$2:$BG$33,27,FALSE)","v":1},{"$f":"VLOOKUP(AR12,Data!$W$2:$BG$33,33,FALSE)","v":3},null,null,null,1,{"$f":"VLOOKUP(AR13,Data!$W$2:$BG$33,3,FALSE)","v":104},{"$f":"VLOOKUP(AR13,Data!$W$2:$BG$33,9,FALSE)","v":272},{"$f":"VLOOKUP(AR13,Data!$W$2:$BG$33,15,FALSE)","v":131},{"$f":"VLOOKUP(AR13,Data!$W$2:$BG$33,21,FALSE)","v":24},{"$f":"VLOOKUP(AR13,Data!$W$2:$BG$33,27,FALSE)","v":0},{"$f":"VLOOKUP(AR13,Data!$W$2:$BG$33,33,FALSE)","v":0}]
[null,null,null,null,2,{"$f":"VLOOKUP(D12,Data!$W$2:$BG$33,4,FALSE)","v":19},{"$f":"VLOOKUP(D12,Data!$W$2:$BG$33,10,FALSE)","v":52},{"$f":"VLOOKUP(D12,Data!$W$2:$BG$33,16,FALSE)","v":13},{"$f":"VLOOKUP(D12,Data!$W$2:$BG$33,22,FALSE)","v":4},{"$f":"VLOOKUP(D12,Data!$W$2:$BG$33,28,FALSE)","v":2},{"$f":"VLOOKUP(D12,Data!$W$2:$BG$33,34,FALSE)","v":0},null,null,null,2,{"$f":"VLOOKUP(D13,Data!$W$2:$BG$33,4,FALSE)","v":53},{"$f":"VLOOKUP(D13,Data!$W$2:$BG$33,10,FALSE)","v":98},{"$f":"VLOOKUP(D13,Data!$W$2:$BG$33,16,FALSE)","v":49},{"$f":"VLOOKUP(D13,Data!$W$2:$BG$33,22,FALSE)","v":15},{"$f":"VLOOKUP(D13,Data!$W$2:$BG$33,28,FALSE)","v":0},{"$f":"VLOOKUP(D13,Data!$W$2:$BG$33,34,FALSE)","v":0},null,null,null,2,{"$f":"VLOOKUP(X12,Data!$W$2:$BG$33,4,FALSE)","v":214},{"$f":"VLOOKUP(X12,Data!$W$2:$BG$33,10,FALSE)","v":136},{"$f":"VLOOKUP(X12,Data!$W$2:$BG$33,16,FALSE)","v":41},{"$f":"VLOOKUP(X12,Data!$W$2:$BG$33,22,FALSE)","v":5},{"$f":"VLOOKUP(X12,Data!$W$2:$BG$33,28,FALSE)","v":0},{"$f":"VLOOKUP(X12,Data!$W$2:$BG$33,34,FALSE)","v":0},null,null,null,2,{"$f":"VLOOKUP(X13,Data!$W$2:$BG$33,4,FALSE)","v":127},{"$f":"VLOOKUP(X13,Data!$W$2:$BG$33,10,FALSE)","v":164},{"$f":"VLOOKUP(X13,Data!$W$2:$BG$33,16,FALSE)","v":49},{"$f":"VLOOKUP(X13,Data!$W$2:$BG$33,22,FALSE)","v":4},{"$f":"VLOOKUP(X13,Data!$W$2:$BG$33,28,FALSE)","v":1},{"$f":"VLOOKUP(X13,Data!$W$2:$BG$33,34,FALSE)","v":0},null,null,null,2,{"$f":"VLOOKUP(AR12,Data!$W$2:$BG$33,4,FALSE)","v":233},{"$f":"VLOOKUP(AR12,Data!$W$2:$BG$33,10,FALSE)","v":159},{"$f":"VLOOKUP(AR12,Data!$W$2:$BG$33,16,FALSE)","v":29},{"$f":"VLOOKUP(AR12,Data!$W$2:$BG$33,22,FALSE)","v":2},{"$f":"VLOOKUP(AR12,Data!$W$2:$BG$33,28,FALSE)","v":1},{"$f":"VLOOKUP(AR12,Data!$W$2:$BG$33,34,FALSE)","v":0},null,null,null,2,{"$f":"VLOOKUP(AR13,Data!$W$2:$BG$33,4,FALSE)","v":54},{"$f":"VLOOKUP(AR13,Data!$W$2:$BG$33,10,FALSE)","v":117},{"$f":"VLOOKUP(AR13,Data!$W$2:$BG$33,16,FALSE)","v":77},{"$f":"VLOOKUP(AR13,Data!$W$2:$BG$33,22,FALSE)","v":6},{"$f":"VLOOKUP(AR13,Data!$W$2:$BG$33,28,FALSE)","v":3},{"$f":"VLOOKUP(AR13,Data!$W$2:$BG$33,34,FALSE)","v":1}]
[null,null,null,null,3,{"$f":"VLOOKUP(D12,Data!$W$2:$BG$33,5,FALSE)","v":1},{"$f":"VLOOKUP(D12,Data!$W$2:$BG$33,11,FALSE)","v":3},{"$f":"VLOOKUP(D12,Data!$W$2:$BG$33,17,FALSE)","v":3},{"$f":"VLOOKUP(D12,Data!$W$2:$BG$33,23,FALSE)","v":1},{"$f":"VLOOKUP(D12,Data!$W$2:$BG$33,29,FALSE)","v":0},{"$f":"VLOOKUP(D12,Data!$W$2:$BG$33,35,FALSE)","v":0},null,null,null,3,{"$f":"VLOOKUP(D13,Data!$W$2:$BG$33,5,FALSE)","v":4},{"$f":"VLOOKUP(D13,Data!$W$2:$BG$33,11,FALSE)","v":9},{"$f":"VLOOKUP(D13,Data!$W$2:$BG$33,17,FALSE)","v":8},{"$f":"VLOOKUP(D13,Data!$W$2:$BG$33,23,FALSE)","v":3},{"$f":"VLOOKUP(D13,Data!$W$2:$BG$33,29,FALSE)","v":0},{"$f":"VLOOKUP(D13,Data!$W$2:$BG$33,35,FALSE)","v":0},null,null,null,3,{"$f":"VLOOKUP(X12,Data!$W$2:$BG$33,5,FALSE)","v":30},{"$f":"VLOOKUP(X12,Data!$W$2:$BG$33,11,FALSE)","v":55},{"$f":"VLOOKUP(X12,Data!$W$2:$BG$33,17,FALSE)","v":6},{"$f":"VLOOKUP(X12,Data!$W$2:$BG$33,23,FALSE)","v":0},{"$f":"VLOOKUP(X12,Data!$W$2:$BG$33,29,FALSE)","v":1},{"$f":"VLOOKUP(X12,Data!$W$2:$BG$33,35,FALSE)","v":0},null,null,null,3,{"$f":"VLOOKUP(X13,Data!$W$2:$BG$33,5,FALSE)","v":18},{"$f":"VLOOKUP(X13,Data!$W$2:$BG$33,11,FALSE)","v":50},{"$f":"VLOOKUP(X13,Data!$W$2:$BG$33,17,FALSE)","v":11},{"$f":"VLOOKUP(X13,Data!$W$2:$BG$33,23,FALSE)","v":0},{"$f":"VLOOKUP(X13,Data!$W$2:$BG$33,29,FALSE)","v":0},{"$f":"VLOOKUP(X13,Data!$W$2:$BG$33,35,FALSE)","v":0},null,null,null,3,{"$f":"VLOOKUP(AR12,Data!$W$2:$BG$33,5,FALSE)","v":88},{"$f":"VLOOKUP(AR12,Data!$W$2:$BG$33,11,FALSE)","v":83},{"$f":"VLOOKUP(AR12,Data!$W$2:$BG$33,17,FALSE)","v":13},{"$f":"VLOOKUP(AR12,Data!$W$2:$BG$33,23,FALSE)","v":0},{"$f":"VLOOKUP(AR12,Data!$W$2:$BG$33,29,FALSE)","v":1},{"$f":"VLOOKUP(AR12,Data!$W$2:$BG$33,35,FALSE)","v":0},null,null,null,3,{"$f":"VLOOKUP(AR13,Data!$W$2:$BG$33,5,FALSE)","v":2},{"$f":"VLOOKUP(AR13,Data!$W$2:$BG$33,11,FALSE)","v":22},{"$f":"VLOOKUP(AR13,Data!$W$2:$BG$33,17,FALSE)","v":10},{"$f":"VLOOKUP(AR13,Data!$W$2:$BG$33,23,FALSE)","v":1},{"$f":"VLOOKUP(AR13,Data!$W$2:$BG$33,29,FALSE)","v":0},{"$f":"VLOOKUP(AR13,Data!$W$2:$BG$33,35,FALSE)","v":0}]
[null,null,null,null,4,{"$f":"VLOOKUP(D12,Data!$W$2:$BG$33,6,FALSE)","v":0},{"$f":"VLOOKUP(D12,Data!$W$2:$BG$33,12,FALSE)","v":0},{"$f":"VLOOKUP(D12,Data!$W$2:$BG$33,18,FALSE)","v":0},{"$f":"VLOOKUP(D12,Data!$W$2:$BG$33,24,FALSE)","v":1},{"$f":"VLOOKUP(D12,Data!$W$2:$BG$33,30,FALSE)","v":0},{"$f":"VLOOKUP(D12,Data!$W$2:$BG$33,36,FALSE)","v":0},null,null,null,4,{"$f":"VLOOKUP(D13,Data!$W$2:$BG$33,6,FALSE)","v":0},{"$f":"VLOOKUP(D13,Data!$W$2:$BG$33,12,FALSE)","v":0},{"$f":"VLOOKUP(D13,Data!$W$2:$BG$33,18,FALSE)","v":0},{"$f":"VLOOKUP(D13,Data!$W$2:$BG$33,24,FALSE)","v":1},{"$f":"VLOOKUP(D13,Data!$W$2:$BG$33,30,FALSE)","v":0},{"$f":"VLOOKUP(D13,Data!$W$2:$BG$33,36,FALSE)","v":1},null,null,null,4,{"$f":"VLOOKUP(X12,Data!$W$2:$BG$33,6,FALSE)","v":5},{"$f":"VLOOKUP(X12,Data!$W$2:$BG$33,12,FALSE)","v":1},{"$f":"VLOOKUP(X12,Data!$W$2:$BG$33,18,FALSE)","v":1},{"$f":"VLOOKUP(X12,Data!$W$2:$BG$33,24,FALSE)","v":1},{"$f":"VLOOKUP(X12,Data!$W$2:$BG$33,30,FALSE)","v":0},{"$f":"VLOOKUP(X12,Data!$W$2:$BG$33,36,FALSE)","v":0},null,null,null,4,{"$f":"VLOOKUP(X13,Data!$W$2:$BG$33,6,FALSE)","v":1},{"$f":"VLOOKUP(X13,Data!$W$2:$BG$33,12,FALSE)","v":1},{"$f":"VLOOKUP(X13,Data!$W$2:$BG$33,18,FALSE)","v":0},{"$f":"VLOOKUP(X13,Data!$W$2:$BG$33,24,FALSE)","v":0},{"$f":"VLOOKUP(X13,Data!$W$2:$BG$33,30,FALSE)","v":1},{"$f":"VLOOKUP(X13,Data!$W$2:$BG$33,36,FALSE)","v":0},null,null,null,4,{"$f":"VLOOKUP(AR12,Data!$W$2:$BG$33,6,FALSE)","v":8},{"$f":"VLOOKUP(AR12,Data!$W$2:$BG$33,12,FALSE)","v":8},{"$f":"VLOOKUP(AR12,Data!$W$2:$BG$33,18,FALSE)","v":0},{"$f":"VLOOKUP(AR12,Data!$W$2:$BG$33,24,FALSE)","v":0},{"$f":"VLOOKUP(AR12,Data!$W$2:$BG$33,30,FALSE)","v":0},{"$f":"VLOOKUP(AR12,Data!$W$2:$BG$33,36,FALSE)","v":1},null,null,null,4,{"$f":"VLOOKUP(AR13,Data!$W$2:$BG$33,6,FALSE)","v":0},{"$f":"VLOOKUP(AR13,Data!$W$2:$BG$33,12,FALSE)","v":1},{"$f":"VLOOKUP(AR13,Data!$W$2:$BG$33,18,FALSE)","v":0},{"$f":"VLOOKUP(AR13,Data!$W$2:$BG$33,24,FALSE)","v":0},{"$f":"VLOOKUP(AR13,Data!$W$2:$BG$33,30,FALSE)","v":0},{"$f":"VLOOKUP(AR13,Data!$W$2:$BG$33,36,FALSE)","v":0}]
[null,null,null,null,"4+",{"$f":"VLOOKUP(D12,Data!$W$2:$BG$33,7,FALSE)","v":0},{"$f":"VLOOKUP(D12,Data!$W$2:$BG$33,13,FALSE)","v":2},{"$f":"VLOOKUP(D12,Data!$W$2:$BG$33,19,FALSE)","v":1},{"$f":"VLOOKUP(D12,Data!$W$2:$BG$33,25,FALSE)","v":1},{"$f":"VLOOKUP(D12,Data!$W$2:$BG$33,31,FALSE)","v":0},{"$f":"VLOOKUP(D12,Data!$W$2:$BG$33,37,FALSE)","v":0},null,null,null,"4+",{"$f":"VLOOKUP(D13,Data!$W$2:$BG$33,7,FALSE)","v":0},{"$f":"VLOOKUP(D13,Data!$W$2:$BG$33,13,FALSE)","v":0},{"$f":"VLOOKUP(D13,Data!$W$2:$BG$33,19,FALSE)","v":0},{"$f":"VLOOKUP(D13,Data!$W$2:$BG$33,25,FALSE)","v":0},{"$f":"VLOOKUP(D13,Data!$W$2:$BG$33,31,FALSE)","v":0},{"$f":"VLOOKUP(D13,Data!$W$2:$BG$33,37,FALSE)","v":2},null,null,null,"4+",{"$f":"VLOOKUP(X12,Data!$W$2:$BG$33,7,FALSE)","v":1},{"$f":"VLOOKUP(X12,Data!$W$2:$BG$33,13,FALSE)","v":0},{"$f":"VLOOKUP(X12,Data!$W$2:$BG$33,19,FALSE)","v":0},{"$f":"VLOOKUP(X12,Data!$W$2:$BG$33,25,FALSE)","v":1},{"$f":"VLOOKUP(X12,Data!$W$2:$BG$33,31,FALSE)","v":1},{"$f":"VLOOKUP(X12,Data!$W$2:$BG$33,37,FALSE)","v":0},null,null,null,"4+",{"$f":"VLOOKUP(X13,Data!$W$2:$BG$33,7,FALSE)","v":0},{"$f":"VLOOKUP(X13,Data!$W$2:$BG$33,13,FALSE)","v":0},{"$f":"VLOOKUP(X13,Data!$W$2:$BG$33,19,FALSE)","v":0},{"$f":"VLOOKUP(X13,Data!$W$2:$BG$33,25,FALSE)","v":0},{"$f":"VLOOKUP(X13,Data!$W$2:$BG$33,31,FALSE)","v":0},{"$f":"VLOOKUP(X13,Data!$W$2:$BG$33,37,FALSE)","v":1},null,null,null,"4+",{"$f":"VLOOKUP(AR12,Data!$W$2:$BG$33,7,FALSE)","v":2},{"$f":"VLOOKUP(AR12,Data!$W$2:$BG$33,13,FALSE)","v":0},{"$f":"VLOOKUP(AR12,Data!$W$2:$BG$33,19,FALSE)","v":1},{"$f":"VLOOKUP(AR12,Data!$W$2:$BG$33,25,FALSE)","v":0},{"$f":"VLOOKUP(AR12,Data!$W$2:$BG$33,31,FALSE)","v":0},{"$f":"VLOOKUP(AR12,Data!$W$2:$BG$33,37,FALSE)","v":2},null,null,null,"4+",{"$f":"VLOOKUP(AR13,Data!$W$2:$BG$33,7,FALSE)","v":0},{"$f":"VLOOKUP(AR13,Data!$W$2:$BG$33,13,FALSE)","v":1},{"$f":"VLOOKUP(AR13,Data!$W$2:$BG$33,19,FALSE)","v":0},{"$f":"VLOOKUP(AR13,Data!$W$2:$BG$33,25,FALSE)","v":0},{"$f":"VLOOKUP(AR13,Data!$W$2:$BG$33,31,FALSE)","v":0},{"$f":"VLOOKUP(AR13,Data!$W$2:$BG$33,37,FALSE)","v":2},null,null,{"$f":"SUM(E16:BI22)-120","v":6528}]
[]
[null,null,null,null,"Groupe B"]
[]
[null,null,null,7,{"$f":"VLOOKUP(D26,Data!$B$2:$J$33,7,FALSE)","v":"2012-06-09T18:00:00"},null,null,null,null,null,null,null,null,null,null,null,null,null,null,null,null,null,null,9,{"$f":"VLOOKUP(X26,Data!$B$2:$J$33,7,FALSE)","v":"2012-06-13T18:00:00"},null,null,null,null,null,null,null,null,null,null,null,null,null,null,null,null,null,null,11,{"$f":"VLOOKUP(AR26,Data!$B$2:$J$33,7,FALSE)","v":"2012-06-17T20:45:00"}]
[]
[null,null,null,7,{"$f":"VLOOKUP(D28,Data!$B$2:$J$33,5,FALSE)","v":"Pays-Bas"},null,null,"vs",{"$f":"VLOOKUP(D28,Data!$B$2:$J$33,6,FALSE)","v":"Danemark"},null,null,null,1,null,{"$f":"VLOOKUP(D29,Data!$B$2:$J$33,5,FALSE)","v":"Allemagne"},null,null,"vs",{"$f":"VLOOKUP(D29,Data!$B$2:$J$33,6,FALSE)","v":"Portugal"},null,null,null,null,9,{"$f":"VLOOKUP(X28,Data!$B$2:$J$33,5,FALSE)","v":"Danemark"},null,null,"vs",{"$f":"VLOOKUP(X28,Data!$B$2:$J$33,6,FALSE)","v":"Portugal"},null,null,null,null,null,{"$f":"VLOOKUP(X29,Data!$B$2:$J$33,5,FALSE)","v":"Pays-Bas"},null,null,"vs",{"$f":"VLOOKUP(X29,Data!$B$2:$J$33,6,FALSE)","v":"Allemagne"},null,null,null,null,11,{"$f":"VLOOKUP(AR28,Data!$B$2:$J$33,5,FALSE)","v":"Portugal"},null,null,"vs",{"$f":"VLOOKUP(AR28,Data!$B$2:$J$33,6,FALSE)","v":"Pays-Bas"},null,null,null,null,null,{"$f":"VLOOKUP(AR29,Data!$B$2:$J$33,5,FALSE)","v":"Danemark"},null,null,"vs",{"$f":"VLOOKUP(AR29,Data!$B$2:$J$33,6,FALSE)","v":"Allemagne"}]
[null,null,null,8,{"$f":"VLOOKUP(D28,Data!$B$2:$J$33,2,FALSE)","v":0},null,null,{"$f":"H13","v":"à"},{"$f":"VLOOKUP(D28,Data!$B$2:$J$33,3,FALSE)","v":1},null,null,null,null,null,{"$f":"VLOOKUP(D29,Data!$B$2:$J$33,2,FALSE)","v":1},null,null,{"$f":"H13","v":"à"},{"$f":"VLOOKUP(D29,Data!$B$2:$J$33,3,FALSE)","v":0},null,null,null,null,10,{"$f":"VLOOKUP(X28,Data!$B$2:$J$33,2,FALSE)","v":2},null,null,{"$f":"H13","v":"à"},{"$f":"VLOOKUP(X28,Data!$B$2:$J$33,3,FALSE)","v":3},null,null,null,null,null,{"$f":"VLOOKUP(X29,Data!$B$2:$J$33,2,FALSE)","v":1},null,null,{"$f":"H13","v":"à"},{"$f":"VLOOKUP(X29,Data!$B$2:$J$33,3,FALSE)","v":2},null,null,null,null,12,{"$f":"VLOOKUP(AR28,Data!$B$2:$J$33,2,FALSE)","v":2},null,null,{"$f":"H13","v":"à"},{"$f":"VLOOKUP(AR28,Data!$B$2:$J$33,3,FALSE)","v":1},null,null,null,null,null,{"$f":"VLOOKUP(AR29,Data!$B$2:$J$33,2,FALSE)","v":1},null,null,{"$f":"H13","v":"à"},{"$f":"VLOOKUP(AR29,Data!$B$2:$J$33,3,FALSE)","v":2}]
[null,null,null,null,{"$f":"ROUND((SUM(G33:G38)*G32+SUM(H33:H38)*H32+SUM(I33:I38)*I32+SUM(J33:J38)*J32+SUM(K33:K38)*5)/IF(SUM(F33:K38)=0,1,SUM(F33:K38)),2)","v":2.2999999999999998},null,null,null,{"$f":"ROUND((SUM(F34:K34)*E34+SUM(F35:K35)*E35+SUM(F36:K36)*E36+SUM(F37:K37)*E37++SUM(F38:K38)*5)/IF(SUM(F33:K38)=0,1,SUM(F33:K38)),2)","v":0.53},null,null,null,null,null,{"$f":"ROUND((SUM(Q33:Q38)*Q32+SUM(R33:R38)*R32+SUM(S33:S38)*S32+SUM(T33:T38)*T32+SUM(U33:U38)*5)/IF(SUM(P33:U38)=0,1,SUM(P33:U38)),2)","v":1.92},null,null,null,{"$f":"ROUND((SUM(P34:U34)*O34+SUM(P35:U35)*O35+SUM(P36:U36)*O36+SUM(P37:U37)*O37++SUM(P38:U38)*5)/IF(SUM(P33:U38)=0,1,SUM(P33:U38)),2)","v":1.02},null,null,null,null,null,{"$f":"ROUND((SUM(AA33:AA38)*AA32+SUM(AB33:AB38)*AB32+SUM(AC33:AC38)*AC32+SUM(AD33:AD38)*AD32+SUM(AE33:AE38)*5)/IF(SUM(Z33:AE38)=0,1,SUM(Z33:AE38)),2)","v":0.62},null,null,null,{"$f":"ROUND((SUM(Z34:AE34)*Y34+SUM(Z35:AE35)*Y35+SUM(Z36:AE36)*Y36+SUM(Z37:AE37)*Y37++SUM(Z38:AE38)*5)/IF(SUM(Z33:AE38)=0,1,SUM(Z33:AE38)),2)","v":1.67},null,null,null,null,null,{"$f":"ROUND((SUM(AK33:AK38)*AK32+SUM(AL33:AL38)*AL32+SUM(AM33:AM38)*AM32+SUM(AN33:AN38)*AN32+SUM(AO33:AO38)*5)/IF(SUM(AJ33:AO38)=0,1,SUM(AJ33:AO38)),2)","v":1.36},null,null,null,{"$f":"ROUND((SUM(AJ34:AO34)*AI34+SUM(AJ35:AO35)*AI35+SUM(AJ36:AO36)*AI36+SUM(AJ37:AO37)*AI37++SUM(AJ38:AO38)*5)/IF(SUM(AJ33:AO38)=0,1,SUM(AJ33:AO38)),2)","v":1.64},null,null,null,null,null,{"$f":"ROUND((SUM(AU33:AU38)*AU32+SUM(AV33:AV38)*AV32+SUM(AW33:AW38)*AW32+SUM(AX33:AX38)*AX32+SUM(AY33:AY38)*5)/IF(SUM(AT33:AY38)=0,1,SUM(AT33:AY38)),2)","v":1.0900000000000001},null,null,null,{"$f":"ROUND((SUM(AT34:AY34)*AS34+SUM(AT35:AY35)*AS35+SUM(AT36:AY36)*AS36+SUM(AT37:AY37)*AS37++SUM(AT38:AY38)*5)/IF(SUM(AT33:AY38)=0,1,SUM(AT33:AY38)),2)","v":1.62},null,null,null,null,null,{"$f":"ROUND((SUM(BE33:BE38)*BE32+SUM(BF33:BF38)*BF32+SUM(BG33:BG38)*BG32+SUM(BH33:BH38)*BH32+SUM(BI33:BI38)*5)/IF(SUM(BD33:BI38)=0,1,SUM(BD33:BI38)),2)","v":0.46},null,null,null,{"$f":"ROUND((SUM(BD34:BI34)*BC34+SUM(BD35:BI35)*BC35+SUM(BD36:BI36)*BC36+SUM(BD37:BI37)*BC37++SUM(BD38:BI38)*5)/IF(SUM(BD33:BI38)=0,1,SUM(BD33:BI38)),2)","v":2.23}]
[null,null,null,null,{"$f":"E28","v":"Pays-Bas"},null,null,null,null,null,null,null,null,null,{"$f":"O28","v":"Allemagne"},null,null,null,null,null,null,null,null,null,{"$f":"Y28","v":"Danemark"},null,null,null,null,null,null,null,null,null,{"$f":"AI28","v":"Pays-Bas"},null,null,null,null,null,null,null,null,null,{"$f":"AS28","v":"Portugal"},null,null,null,null,null,null,null,null,null,{"$f":"BC28","v":"Danemark"}]
[null,null,{"$f":"I28","v":"Danemark"},null,null,0,1,2,3,4,"4+",null,null,{"$f":"S28","v":"Portugal"},null,0,1,2,3,4,"4+",null,{"$f":"AC28","v":"Portugal"},null,null,0,1,2,3,4,"4+",null,null,{"$f":"AM28","v":"Allemagne"},null,0,1,2,3,4,"4+",null,{"$f":"AW28","v":"Pays-Bas"},null,null,0,1,2,3,4,"4+",null,null,{"$f":"BG28","v":"Allemagne"},null,0,1,2,3,4,"4+"]
[null,null,null,null,0,{"$f":"VLOOKUP(D28,Data!$W$2:$BG$33,2,FALSE)","v":10},{"$f":"VLOOKUP(D28,Data!$W$2:$BG$33,8,FALSE)","v":61},{"$f":"VLOOKUP(D28,Data!$W$2:$BG$33,14,FALSE)","v":308},{"$f":"VLOOKUP(D28,Data!$W$2:$BG$33,20,FALSE)","v":126},{"$f":"VLOOKUP(D28,Data!$W$2:$BG$33,26,FALSE)","v":19},{"$f":"VLOOKUP(D28,Data!$W$2:$BG$33,32,FALSE)","v":3},null,null,null,0,{"$f":"VLOOKUP(D29,Data!$W$2:$BG$33,2,FALSE)","v":18},{"$f":"VLOOKUP(D29,Data!$W$2:$BG$33,8,FALSE)","v":83},{"$f":"VLOOKUP(D29,Data!$W$2:$BG$33,14,FALSE)","v":107},{"$f":"VLOOKUP(D29,Data!$W$2:$BG$33,20,FALSE)","v":17},{"$f":"VLOOKUP(D29,Data!$W$2:$BG$33,26,FALSE)","v":3},{"$f":"VLOOKUP(D29,Data!$W$2:$BG$33,32,FALSE)","v":0},null,null,null,0,{"$f":"VLOOKUP(X28,Data!$W$2:$BG$33,2,FALSE)","v":36},{"$f":"VLOOKUP(X28,Data!$W$2:$BG$33,8,FALSE)","v":43},{"$f":"VLOOKUP(X28,Data!$W$2:$BG$33,14,FALSE)","v":6},{"$f":"VLOOKUP(X28,Data!$W$2:$BG$33,20,FALSE)","v":0},{"$f":"VLOOKUP(X28,Data!$W$2:$BG$33,26,FALSE)","v":1},{"$f":"VLOOKUP(X28,Data!$W$2:$BG$33,32,FALSE)","v":0},null,null,null,0,{"$f":"VLOOKUP(X29,Data!$W$2:$BG$33,2,FALSE)","v":22},{"$f":"VLOOKUP(X29,Data!$W$2:$BG$33,8,FALSE)","v":30},{"$f":"VLOOKUP(X29,Data!$W$2:$BG$33,14,FALSE)","v":16},{"$f":"VLOOKUP(X29,Data!$W$2:$BG$33,20,FALSE)","v":0},{"$f":"VLOOKUP(X29,Data!$W$2:$BG$33,26,FALSE)","v":0},{"$f":"VLOOKUP(X29,Data!$W$2:$BG$33,32,FALSE)","v":0},null,null,null,0,{"$f":"VLOOKUP(AR28,Data!$W$2:$BG$33,2,FALSE)","v":36},{"$f":"VLOOKUP(AR28,Data!$W$2:$BG$33,8,FALSE)","v":46},{"$f":"VLOOKUP(AR28,Data!$W$2:$BG$33,14,FALSE)","v":21},{"$f":"VLOOKUP(AR28,Data!$W$2:$BG$33,20,FALSE)","v":1},{"$f":"VLOOKUP(AR28,Data!$W$2:$BG$33,26,FALSE)","v":1},{"$f":"VLOOKUP(AR28,Data!$W$2:$BG$33,32,FALSE)","v":0},null,null,null,0,{"$f":"VLOOKUP(AR29,Data!$W$2:$BG$33,2,FALSE)","v":17},{"$f":"VLOOKUP(AR29,Data!$W$2:$BG$33,8,FALSE)","v":8},{"$f":"VLOOKUP(AR29,Data!$W$2:$BG$33,14,FALSE)","v":6},{"$f":"VLOOKUP(AR29,Data!$W$2:$BG$33,20,FALSE)","v":0},{"$f":"VLOOKUP(AR29,Data!$W$2:$BG$33,26,FALSE)","v":0},{"$f":"VLOOKUP(AR29,Data!$W$2:$BG$33,32,FALSE)","v":0}]
[null,null,null,null,1,{"$f":"VLOOKUP(D28,Data!$W$2:$BG$33,3,FALSE)","v":7},{"$f":"VLOOKUP(D28,Data!$W$2:$BG$33,9,FALSE)","v":32},{"$f":"VLOOKUP(D28,Data!$W$2:$BG$33,15,FALSE)","v":146},{"$f":"VLOOKUP(D28,Data!$W$2:$BG$33,21,FALSE)","v":193},{"$f":"VLOOKUP(D28,Data!$W$2:$BG$33,27,FALSE)","v":19},{"$f":"VLOOKUP(D28,Data!$W$2:$BG$33,33,FALSE)","v":1},null,null,null,1,{"$f":"VLOOKUP(D29,Data!$W$2:$BG$33,3,FALSE)","v":15},{"$f":"VLOOKUP(D29,Data!$W$2:$BG$33,9,FALSE)","v":107},{"$f":"VLOOKUP(D29,Data!$W$2:$BG$33,15,FALSE)","v":310},{"$f":"VLOOKUP(D29,Data!$W$2:$BG$33,21,FALSE)","v":109},{"$f":"VLOOKUP(D29,Data!$W$2:$BG$33,27,FALSE)","v":5},{"$f":"VLOOKUP(D29,Data!$W$2:$BG$33,33,FALSE)","v":0},null,null,null,1,{"$f":"VLOOKUP(X28,Data!$W$2:$BG$33,3,FALSE)","v":218},{"$f":"VLOOKUP(X28,Data!$W$2:$BG$33,9,FALSE)","v":117},{"$f":"VLOOKUP(X28,Data!$W$2:$BG$33,15,FALSE)","v":36},{"$f":"VLOOKUP(X28,Data!$W$2:$BG$33,21,FALSE)","v":3},{"$f":"VLOOKUP(X28,Data!$W$2:$BG$33,27,FALSE)","v":0},{"$f":"VLOOKUP(X28,Data!$W$2:$BG$33,33,FALSE)","v":1},null,null,null,1,{"$f":"VLOOKUP(X29,Data!$W$2:$BG$33,3,FALSE)","v":67},{"$f":"VLOOKUP(X29,Data!$W$2:$BG$33,9,FALSE)","v":235},{"$f":"VLOOKUP(X29,Data!$W$2:$BG$33,15,FALSE)","v":76},{"$f":"VLOOKUP(X29,Data!$W$2:$BG$33,21,FALSE)","v":11},{"$f":"VLOOKUP(X29,Data!$W$2:$BG$33,27,FALSE)","v":0},{"$f":"VLOOKUP(X29,Data!$W$2:$BG$33,33,FALSE)","v":1},null,null,null,1,{"$f":"VLOOKUP(AR28,Data!$W$2:$BG$33,3,FALSE)","v":98},{"$f":"VLOOKUP(AR28,Data!$W$2:$BG$33,9,FALSE)","v":210},{"$f":"VLOOKUP(AR28,Data!$W$2:$BG$33,15,FALSE)","v":83},{"$f":"VLOOKUP(AR28,Data!$W$2:$BG$33,21,FALSE)","v":9},{"$f":"VLOOKUP(AR28,Data!$W$2:$BG$33,27,FALSE)","v":1},{"$f":"VLOOKUP(AR28,Data!$W$2:$BG$33,33,FALSE)","v":0},null,null,null,1,{"$f":"VLOOKUP(AR29,Data!$W$2:$BG$33,3,FALSE)","v":117},{"$f":"VLOOKUP(AR29,Data!$W$2:$BG$33,9,FALSE)","v":69},{"$f":"VLOOKUP(AR29,Data!$W$2:$BG$33,15,FALSE)","v":10},{"$f":"VLOOKUP(AR29,Data!$W$2:$BG$33,21,FALSE)","v":3},{"$f":"VLOOKUP(AR29,Data!$W$2:$BG$33,27,FALSE)","v":0},{"$f":"VLOOKUP(AR29,Data!$W$2:$BG$33,33,FALSE)","v":1}]
[null,null,null,null,2,{"$f":"VLOOKUP(D28,Data!$W$2:$BG$33,4,FALSE)","v":3},{"$f":"VLOOKUP(D28,Data!$W$2:$BG$33,10,FALSE)","v":7},{"$f":"VLOOKUP(D28,Data!$W$2:$BG$33,16,FALSE)","v":17},{"$f":"VLOOKUP(D28,Data!$W$2:$BG$33,22,FALSE)","v":15},{"$f":"VLOOKUP(D28,Data!$W$2:$BG$33,28,FALSE)","v":3},{"$f":"VLOOKUP(D28,Data!$W$2:$BG$33,34,FALSE)","v":1},null,null,null,2,{"$f":"VLOOKUP(D29,Data!$W$2:$BG$33,4,FALSE)","v":2},{"$f":"VLOOKUP(D29,Data!$W$2:$BG$33,10,FALSE)","v":32},{"$f":"VLOOKUP(D29,Data!$W$2:$BG$33,16,FALSE)","v":94},{"$f":"VLOOKUP(D29,Data!$W$2:$BG$33,22,FALSE)","v":58},{"$f":"VLOOKUP(D29,Data!$W$2:$BG$33,28,FALSE)","v":4},{"$f":"VLOOKUP(D29,Data!$W$2:$BG$33,34,FALSE)","v":0},null,null,null,2,{"$f":"VLOOKUP(X28,Data!$W$2:$BG$33,4,FALSE)","v":230},{"$f":"VLOOKUP(X28,Data!$W$2:$BG$33,10,FALSE)","v":226},{"$f":"VLOOKUP(X28,Data!$W$2:$BG$33,16,FALSE)","v":38},{"$f":"VLOOKUP(X28,Data!$W$2:$BG$33,22,FALSE)","v":1},{"$f":"VLOOKUP(X28,Data!$W$2:$BG$33,28,FALSE)","v":0},{"$f":"VLOOKUP(X28,Data!$W$2:$BG$33,34,FALSE)","v":0},null,null,null,2,{"$f":"VLOOKUP(X29,Data!$W$2:$BG$33,4,FALSE)","v":39},{"$f":"VLOOKUP(X29,Data!$W$2:$BG$33,10,FALSE)","v":208},{"$f":"VLOOKUP(X29,Data!$W$2:$BG$33,16,FALSE)","v":263},{"$f":"VLOOKUP(X29,Data!$W$2:$BG$33,22,FALSE)","v":27},{"$f":"VLOOKUP(X29,Data!$W$2:$BG$33,28,FALSE)","v":1},{"$f":"VLOOKUP(X29,Data!$W$2:$BG$33,34,FALSE)","v":1},null,null,null,2,{"$f":"VLOOKUP(AR28,Data!$W$2:$BG$33,4,FALSE)","v":81},{"$f":"VLOOKUP(AR28,Data!$W$2:$BG$33,10,FALSE)","v":248},{"$f":"VLOOKUP(AR28,Data!$W$2:$BG$33,16,FALSE)","v":104},{"$f":"VLOOKUP(AR28,Data!$W$2:$BG$33,22,FALSE)","v":8},{"$f":"VLOOKUP(AR28,Data!$W$2:$BG$33,28,FALSE)","v":3},{"$f":"VLOOKUP(AR28,Data!$W$2:$BG$33,34,FALSE)","v":0},null,null,null,2,{"$f":"VLOOKUP(AR29,Data!$W$2:$BG$33,4,FALSE)","v":322},{"$f":"VLOOKUP(AR29,Data!$W$2:$BG$33,10,FALSE)","v":135},{"$f":"VLOOKUP(AR29,Data!$W$2:$BG$33,16,FALSE)","v":10},{"$f":"VLOOKUP(AR29,Data!$W$2:$BG$33,22,FALSE)","v":2},{"$f":"VLOOKUP(AR29,Data!$W$2:$BG$33,28,FALSE)","v":0},{"$f":"VLOOKUP(AR29,Data!$W$2:$BG$33,34,FALSE)","v":0}]
[null,null,null,null,3,{"$f":"VLOOKUP(D28,Data!$W$2:$BG$33,5,FALSE)","v":1},{"$f":"VLOOKUP(D28,Data!$W$2:$BG$33,11,FALSE)","v":0},{"$f":"VLOOKUP(D28,Data!$W$2:$BG$33,17,FALSE)","v":4},{"$f":"VLOOKUP(D28,Data!$W$2:$BG$33,23,FALSE)","v":1},{"$f":"VLOOKUP(D28,Data!$W$2:$BG$33,29,FALSE)","v":0},{"$f":"VLOOKUP(D28,Data!$W$2:$BG$33,35,FALSE)","v":0},null,null,null,3,{"$f":"VLOOKUP(D29,Data!$W$2:$BG$33,5,FALSE)","v":0},{"$f":"VLOOKUP(D29,Data!$W$2:$BG$33,11,FALSE)","v":7},{"$f":"VLOOKUP(D29,Data!$W$2:$BG$33,17,FALSE)","v":9},{"$f":"VLOOKUP(D29,Data!$W$2:$BG$33,23,FALSE)","v":7},{"$f":"VLOOKUP(D29,Data!$W$2:$BG$33,29,FALSE)","v":0},{"$f":"VLOOKUP(D29,Data!$W$2:$BG$33,35,FALSE)","v":0},null,null,null,3,{"$f":"VLOOKUP(X28,Data!$W$2:$BG$33,5,FALSE)","v":52},{"$f":"VLOOKUP(X28,Data!$W$2:$BG$33,11,FALSE)","v":66},{"$f":"VLOOKUP(X28,Data!$W$2:$BG$33,17,FALSE)","v":12},{"$f":"VLOOKUP(X28,Data!$W$2:$BG$33,23,FALSE)","v":0},{"$f":"VLOOKUP(X28,Data!$W$2:$BG$33,29,FALSE)","v":0},{"$f":"VLOOKUP(X28,Data!$W$2:$BG$33,35,FALSE)","v":0},null,null,null,3,{"$f":"VLOOKUP(X29,Data!$W$2:$BG$33,5,FALSE)","v":3},{"$f":"VLOOKUP(X29,Data!$W$2:$BG$33,11,FALSE)","v":34},{"$f":"VLOOKUP(X29,Data!$W$2:$BG$33,17,FALSE)","v":60},{"$f":"VLOOKUP(X29,Data!$W$2:$BG$33,23,FALSE)","v":7},{"$f":"VLOOKUP(X29,Data!$W$2:$BG$33,29,FALSE)","v":1},{"$f":"VLOOKUP(X29,Data!$W$2:$BG$33,35,FALSE)","v":0},null,null,null,3,{"$f":"VLOOKUP(AR28,Data!$W$2:$BG$33,5,FALSE)","v":14},{"$f":"VLOOKUP(AR28,Data!$W$2:$BG$33,11,FALSE)","v":91},{"$f":"VLOOKUP(AR28,Data!$W$2:$BG$33,17,FALSE)","v":42},{"$f":"VLOOKUP(AR28,Data!$W$2:$BG$33,23,FALSE)","v":5},{"$f":"VLOOKUP(AR28,Data!$W$2:$BG$33,29,FALSE)","v":0},{"$f":"VLOOKUP(AR28,Data!$W$2:$BG$33,35,FALSE)","v":0},null,null,null,3,{"$f":"VLOOKUP(AR29,Data!$W$2:$BG$33,5,FALSE)","v":176},{"$f":"VLOOKUP(AR29,Data!$W$2:$BG$33,11,FALSE)","v":138},{"$f":"VLOOKUP(AR29,Data!$W$2:$BG$33,17,FALSE)","v":13},{"$f":"VLOOKUP(AR29,Data!$W$2:$BG$33,23,FALSE)","v":0},{"$f":"VLOOKUP(AR29,Data!$W$2:$BG$33,29,FALSE)","v":1},{"$f":"VLOOKUP(AR29,Data!$W$2:$BG$33,35,FALSE)","v":0}]
[null,null,null,null,4,{"$f":"VLOOKUP(D28,Data!$W$2:$BG$33,6,FALSE)","v":0},{"$f":"VLOOKUP(D28,Data!$W$2:$BG$33,12,FALSE)","v":0},{"$f":"VLOOKUP(D28,Data!$W$2:$BG$33,18,FALSE)","v":0},{"$f":"VLOOKUP(D28,Data!$W$2:$BG$33,24,FALSE)","v":1},{"$f":"VLOOKUP(D28,Data!$W$2:$BG$33,30,FALSE)","v":1},{"$f":"VLOOKUP(D28,Data!$W$2:$BG$33,36,FALSE)","v":0},null,null,null,4,{"$f":"VLOOKUP(D29,Data!$W$2:$BG$33,6,FALSE)","v":0},{"$f":"VLOOKUP(D29,Data!$W$2:$BG$33,12,FALSE)","v":0},{"$f":"VLOOKUP(D29,Data!$W$2:$BG$33,18,FALSE)","v":0},{"$f":"VLOOKUP(D29,Data!$W$2:$BG$33,24,FALSE)","v":1},{"$f":"VLOOKUP(D29,Data!$W$2:$BG$33,30,FALSE)","v":0},{"$f":"VLOOKUP(D29,Data!$W$2:$BG$33,36,FALSE)","v":0},null,null,null,4,{"$f":"VLOOKUP(X28,Data!$W$2:$BG$33,6,FALSE)","v":3},{"$f":"VLOOKUP(X28,Data!$W$2:$BG$33,12,FALSE)","v":8},{"$f":"VLOOKUP(X28,Data!$W$2:$BG$33,18,FALSE)","v":4},{"$f":"VLOOKUP(X28,Data!$W$2:$BG$33,24,FALSE)","v":0},{"$f":"VLOOKUP(X28,Data!$W$2:$BG$33,30,FALSE)","v":1},{"$f":"VLOOKUP(X28,Data!$W$2:$BG$33,36,FALSE)","v":0},null,null,null,4,{"$f":"VLOOKUP(X29,Data!$W$2:$BG$33,6,FALSE)","v":2},{"$f":"VLOOKUP(X29,Data!$W$2:$BG$33,12,FALSE)","v":1},{"$f":"VLOOKUP(X29,Data!$W$2:$BG$33,18,FALSE)","v":5},{"$f":"VLOOKUP(X29,Data!$W$2:$BG$33,24,FALSE)","v":1},{"$f":"VLOOKUP(X29,Data!$W$2:$BG$33,30,FALSE)","v":1},{"$f":"VLOOKUP(X29,Data!$W$2:$BG$33,36,FALSE)","v":0},null,null,null,4,{"$f":"VLOOKUP(AR28,Data!$W$2:$BG$33,6,FALSE)","v":1},{"$f":"VLOOKUP(AR28,Data!$W$2:$BG$33,12,FALSE)","v":4},{"$f":"VLOOKUP(AR28,Data!$W$2:$BG$33,18,FALSE)","v":8},{"$f":"VLOOKUP(AR28,Data!$W$2:$BG$33,24,FALSE)","v":2},{"$f":"VLOOKUP(AR28,Data!$W$2:$BG$33,30,FALSE)","v":0},{"$f":"VLOOKUP(AR28,Data!$W$2:$BG$33,36,FALSE)","v":1},null,null,null,4,{"$f":"VLOOKUP(AR29,Data!$W$2:$BG$33,6,FALSE)","v":43},{"$f":"VLOOKUP(AR29,Data!$W$2:$BG$33,12,FALSE)","v":35},{"$f":"VLOOKUP(AR29,Data!$W$2:$BG$33,18,FALSE)","v":6},{"$f":"VLOOKUP(AR29,Data!$W$2:$BG$33,24,FALSE)","v":1},{"$f":"VLOOKUP(AR29,Data!$W$2:$BG$33,30,FALSE)","v":0},{"$f":"VLOOKUP(AR29,Data!$W$2:$BG$33,36,FALSE)","v":0}]
[null,null,null,null,"4+",{"$f":"VLOOKUP(D28,Data!$W$2:$BG$33,7,FALSE)","v":1},{"$f":"VLOOKUP(D28,Data!$W$2:$BG$33,13,FALSE)","v":0},{"$f":"VLOOKUP(D28,Data!$W$2:$BG$33,19,FALSE)","v":0},{"$f":"VLOOKUP(D28,Data!$W$2:$BG$33,25,FALSE)","v":0},{"$f":"VLOOKUP(D28,Data!$W$2:$BG$33,31,FALSE)","v":0},{"$f":"VLOOKUP(D28,Data!$W$2:$BG$33,37,FALSE)","v":0},null,null,null,"4+",{"$f":"VLOOKUP(D29,Data!$W$2:$BG$33,7,FALSE)","v":0},{"$f":"VLOOKUP(D29,Data!$W$2:$BG$33,13,FALSE)","v":0},{"$f":"VLOOKUP(D29,Data!$W$2:$BG$33,19,FALSE)","v":0},{"$f":"VLOOKUP(D29,Data!$W$2:$BG$33,25,FALSE)","v":0},{"$f":"VLOOKUP(D29,Data!$W$2:$BG$33,31,FALSE)","v":1},{"$f":"VLOOKUP(D29,Data!$W$2:$BG$33,37,FALSE)","v":0},null,null,null,"4+",{"$f":"VLOOKUP(X28,Data!$W$2:$BG$33,7,FALSE)","v":4},{"$f":"VLOOKUP(X28,Data!$W$2:$BG$33,13,FALSE)","v":1},{"$f":"VLOOKUP(X28,Data!$W$2:$BG$33,19,FALSE)","v":0},{"$f":"VLOOKUP(X28,Data!$W$2:$BG$33,25,FALSE)","v":0},{"$f":"VLOOKUP(X28,Data!$W$2:$BG$33,31,FALSE)","v":1},{"$f":"VLOOKUP(X28,Data!$W$2:$BG$33,37,FALSE)","v":0},null,null,null,"4+",{"$f":"VLOOKUP(X29,Data!$W$2:$BG$33,7,FALSE)","v":0},{"$f":"VLOOKUP(X29,Data!$W$2:$BG$33,13,FALSE)","v":0},{"$f":"VLOOKUP(X29,Data!$W$2:$BG$33,19,FALSE)","v":0},{"$f":"VLOOKUP(X29,Data!$W$2:$BG$33,25,FALSE)","v":0},{"$f":"VLOOKUP(X29,Data!$W$2:$BG$33,31,FALSE)","v":1},{"$f":"VLOOKUP(X29,Data!$W$2:$BG$33,37,FALSE)","v":0},null,null,null,"4+",{"$f":"VLOOKUP(AR28,Data!$W$2:$BG$33,7,FALSE)","v":0},{"$f":"VLOOKUP(AR28,Data!$W$2:$BG$33,13,FALSE)","v":1},{"$f":"VLOOKUP(AR28,Data!$W$2:$BG$33,19,FALSE)","v":1},{"$f":"VLOOKUP(AR28,Data!$W$2:$BG$33,25,FALSE)","v":0},{"$f":"VLOOKUP(AR28,Data!$W$2:$BG$33,31,FALSE)","v":0},{"$f":"VLOOKUP(AR28,Data!$W$2:$BG$33,37,FALSE)","v":0},null,null,null,"4+",{"$f":"VLOOKUP(AR29,Data!$W$2:$BG$33,7,FALSE)","v":3},{"$f":"VLOOKUP(AR29,Data!$W$2:$BG$33,13,FALSE)","v":3},{"$f":"VLOOKUP(AR29,Data!$W$2:$BG$33,19,FALSE)","v":0},{"$f":"VLOOKUP(AR29,Data!$W$2:$BG$33,25,FALSE)","v":0},{"$f":"VLOOKUP(AR29,Data!$W$2:$BG$33,31,FALSE)","v":0},{"$f":"VLOOKUP(AR29,Data!$W$2:$BG$33,37,FALSE)","v":1},null,null,{"$f":"SUM(E32:BI38)-120","v":6430}]
[]
[null,null,null,null,"Groupe C"]
[]
[null,null,null,13,{"$f":"VLOOKUP(D42,Data!$B$2:$J$33,7,FALSE)","v":"2012-06-10T18:00:00"},null,null,null,null,null,null,null,null,null,null,null,null,null,null,null,null,null,null,15,{"$f":"VLOOKUP(X42,Data!$B$2:$J$33,7,FALSE)","v":"2012-06-14T18:00:00"},null,null,null,null,null,null,null,null,null,null,null,null,null,null,null,null,null,null,17,{"$f":"VLOOKUP(AR42,Data!$B$2:$J$33,7,FALSE)","v":"2012-06-18T20:45:00"}]
[]
[null,null,null,13,{"$f":"VLOOKUP(D44,Data!$B$2:$J$33,5,FALSE)","v":"Espagne"},null,null,"vs",{"$f":"VLOOKUP(D44,Data!$B$2:$J$33,6,FALSE)","v":"Italie"},null,null,null,1,null,{"$f":"VLOOKUP(D45,Data!$B$2:$J$33,5,FALSE)","v":"Irlande"},null,null,"vs",{"$f":"VLOOKUP(D45,Data!$B$2:$J$33,6,FALSE)","v":"Croatie"},null,null,null,null,15,{"$f":"VLOOKUP(X44,Data!$B$2:$J$33,5,FALSE)","v":"Italie"},null,null,"vs",{"$f":"VLOOKUP(X44,Data!$B$2:$J$33,6,FALSE)","v":"Croatie"},null,null,null,null,null,{"$f":"VLOOKUP(X45,Data!$B$2:$J$33,5,FALSE)","v":"Espagne"},null,null,"vs",{"$f":"VLOOKUP(X45,Data!$B$2:$J$33,6,FALSE)","v":"Irlande"},null,null,null,null,17,{"$f":"VLOOKUP(AR44,Data!$B$2:$J$33,5,FALSE)","v":"Croatie"},null,null,"vs",{"$f":"VLOOKUP(AR44,Data!$B$2:$J$33,6,FALSE)","v":"Espagne"},null,null,null,null,null,{"$f":"VLOOKUP(AR45,Data!$B$2:$J$33,5,FALSE)","v":"Italie"},null,null,"vs",{"$f":"VLOOKUP(AR45,Data!$B$2:$J$33,6,FALSE)","v":"Irlande"}]
[null,null,null,14,{"$f":"VLOOKUP(D44,Data!$B$2:$J$33,2,FALSE)","v":1},null,null,{"$f":"H13","v":"à"},{"$f":"VLOOKUP(D44,Data!$B$2:$J$33,3,FALSE)","v":1},null,null,null,null,null,{"$f":"VLOOKUP(D45,Data!$B$2:$J$33,2,FALSE)","v":1},null,null,{"$f":"H13","v":"à"},{"$f":"VLOOKUP(D45,Data!$B$2:$J$33,3,FALSE)","v":3},null,null,null,null,16,{"$f":"VLOOKUP(X44,Data!$B$2:$J$33,2,FALSE)","v":1},null,null,{"$f":"H13","v":"à"},{"$f":"VLOOKUP(X44,Data!$B$2:$J$33,3,FALSE)","v":1},null,null,null,null,null,{"$f":"VLOOKUP(X45,Data!$B$2:$J$33,2,FALSE)","v":4},null,null,{"$f":"H13","v":"à"},{"$f":"VLOOKUP(X45,Data!$B$2:$J$33,3,FALSE)","v":0},null,null,null,null,18,{"$f":"VLOOKUP(AR44,Data!$B$2:$J$33,2,FALSE)","v":0},null,null,{"$f":"H13","v":"à"},{"$f":"VLOOKUP(AR44,Data!$B$2:$J$33,3,FALSE)","v":1},null,null,null,null,null,{"$f":"VLOOKUP(AR45,Data!$B$2:$J$33,2,FALSE)","v":2},null,null,{"$f":"H13","v":"à"},{"$f":"VLOOKUP(AR45,Data!$B$2:$J$33,3,FALSE)","v":0}]
[null,null,null,null,{"$f":"ROUND((SUM(G49:G54)*G48+SUM(H49:H54)*H48+SUM(I49:I54)*I48+SUM(J49:J54)*J48+SUM(K49:K54)*5)/IF(SUM(F49:K54)=0,1,SUM(F49:K54)),2)","v":1.75},null,null,null,{"$f":"ROUND((SUM(F50:K50)*E50+SUM(F51:K51)*E51+SUM(F52:K52)*E52+SUM(F53:K53)*E53++SUM(F54:K54)*5)/IF(SUM(F49:K54)=0,1,SUM(F49:K54)),2)","v":0.75},null,null,null,null,null,{"$f":"ROUND((SUM(Q49:Q54)*Q48+SUM(R49:R54)*R48+SUM(S49:S54)*S48+SUM(T49:T54)*T48+SUM(U49:U54)*5)/IF(SUM(P49:U54)=0,1,SUM(P49:U54)),2)","v":0.69},null,null,null,{"$f":"ROUND((SUM(P50:U50)*O50+SUM(P51:U51)*O51+SUM(P52:U52)*O52+SUM(P53:U53)*O53++SUM(P54:U54)*5)/IF(SUM(P49:U54)=0,1,SUM(P49:U54)),2)","v":1.19},null,null,null,null,null,{"$f":"ROUND((SUM(AA49:AA54)*AA48+SUM(AB49:AB54)*AB48+SUM(AC49:AC54)*AC48+SUM(AD49:AD54)*AD48+SUM(AE49:AE54)*5)/IF(SUM(Z49:AE54)=0,1,SUM(Z49:AE54)),2)","v":1.36},null,null,null,{"$f":"ROUND((SUM(Z50:AE50)*Y50+SUM(Z51:AE51)*Y51+SUM(Z52:AE52)*Y52+SUM(Z53:AE53)*Y53++SUM(Z54:AE54)*5)/IF(SUM(Z49:AE54)=0,1,SUM(Z49:AE54)),2)","v":0.81},null,null,null,null,null,{"$f":"ROUND((SUM(AK49:AK54)*AK48+SUM(AL49:AL54)*AL48+SUM(AM49:AM54)*AM48+SUM(AN49:AN54)*AN48+SUM(AO49:AO54)*5)/IF(SUM(AJ49:AO54)=0,1,SUM(AJ49:AO54)),2)","v":2.5099999999999998},null,null,null,{"$f":"ROUND((SUM(AJ50:AO50)*AI50+SUM(AJ51:AO51)*AI51+SUM(AJ52:AO52)*AI52+SUM(AJ53:AO53)*AI53++SUM(AJ54:AO54)*5)/IF(SUM(AJ49:AO54)=0,1,SUM(AJ49:AO54)),2)","v":0.28999999999999998},null,null,null,null,null,{"$f":"ROUND((SUM(AU49:AU54)*AU48+SUM(AV49:AV54)*AV48+SUM(AW49:AW54)*AW48+SUM(AX49:AX54)*AX48+SUM(AY49:AY54)*5)/IF(SUM(AT49:AY54)=0,1,SUM(AT49:AY54)),2)","v":0.62},null,null,null,{"$f":"ROUND((SUM(AT50:AY50)*AS50+SUM(AT51:AY51)*AS51+SUM(AT52:AY52)*AS52+SUM(AT53:AY53)*AS53++SUM(AT54:AY54)*5)/IF(SUM(AT49:AY54)=0,1,SUM(AT49:AY54)),2)","v":2.02},null,null,null,null,null,{"$f":"ROUND((SUM(BE49:BE54)*BE48+SUM(BF49:BF54)*BF48+SUM(BG49:BG54)*BG48+SUM(BH49:BH54)*BH48+SUM(BI49:BI54)*5)/IF(SUM(BD49:BI54)=0,1,SUM(BD49:BI54)),2)","v":1.56},null,null,null,{"$f":"ROUND((SUM(BD50:BI50)*BC50+SUM(BD51:BI51)*BC51+SUM(BD52:BI52)*BC52+SUM(BD53:BI53)*BC53++SUM(BD54:BI54)*5)/IF(SUM(BD49:BI54)=0,1,SUM(BD49:BI54)),2)","v":0.49}]
[null,null,null,null,{"$f":"E44","v":"Espagne"},null,null,null,null,null,null,null,null,null,{"$f":"O44","v":"Irlande"},null,null,null,null,null,null,null,null,null,{"$f":"Y44","v":"Italie"},null,null,null,null,null,null,null,null,null,{"$f":"AI44","v":"Espagne"},null,null,null,null,null,null,null,null,null,{"$f":"AS44","v":"Croatie"},null,null,null,null,null,null,null,null,null,{"$f":"BC44","v":"Italie"}]
[null,null,{"$f":"I44","v":"Italie"},null,null,0,1,2,3,4,"4+",null,null,{"$f":"S44","v":"Croatie"},null,0,1,2,3,4,"4+",null,{"$f":"AC44","v":"Croatie"},null,null,0,1,2,3,4,"4+",null,null,{"$f":"AM44","v":"Irlande"},null,0,1,2,3,4,"4+",null,{"$f":"AW44","v":"Espagne"},null,null,0,1,2,3,4,"4+",null,null,{"$f":"BG44","v":"Irlande"},null,0,1,2,3,4,"4+"]
[null,null,null,null,0,{"$f":"VLOOKUP(D44,Data!$W$2:$BG$33,2,FALSE)","v":51},{"$f":"VLOOKUP(D44,Data!$W$2:$BG$33,8,FALSE)","v":123},{"$f":"VLOOKUP(D44,Data!$W$2:$BG$33,14,FALSE)","v":174},{"$f":"VLOOKUP(D44,Data!$W$2:$BG$33,20,FALSE)","v":23},{"$f":"VLOOKUP(D44,Data!$W$2:$BG$33,26,FALSE)","v":2},{"$f":"VLOOKUP(D44,Data!$W$2:$BG$33,32,FALSE)","v":0},null,null,null,0,{"$f":"VLOOKUP(D45,Data!$W$2:$BG$33,2,FALSE)","v":93},{"$f":"VLOOKUP(D45,Data!$W$2:$BG$33,8,FALSE)","v":90},{"$f":"VLOOKUP(D45,Data!$W$2:$BG$33,14,FALSE)","v":21},{"$f":"VLOOKUP(D45,Data!$W$2:$BG$33,20,FALSE)","v":2},{"$f":"VLOOKUP(D45,Data!$W$2:$BG$33,26,FALSE)","v":1},{"$f":"VLOOKUP(D45,Data!$W$2:$BG$33,32,FALSE)","v":0},null,null,null,0,{"$f":"VLOOKUP(X44,Data!$W$2:$BG$33,2,FALSE)","v":62},{"$f":"VLOOKUP(X44,Data!$W$2:$BG$33,8,FALSE)","v":212},{"$f":"VLOOKUP(X44,Data!$W$2:$BG$33,14,FALSE)","v":86},{"$f":"VLOOKUP(X44,Data!$W$2:$BG$33,20,FALSE)","v":18},{"$f":"VLOOKUP(X44,Data!$W$2:$BG$33,26,FALSE)","v":0},{"$f":"VLOOKUP(X44,Data!$W$2:$BG$33,32,FALSE)","v":0},null,null,null,0,{"$f":"VLOOKUP(X45,Data!$W$2:$BG$33,2,FALSE)","v":4},{"$f":"VLOOKUP(X45,Data!$W$2:$BG$33,8,FALSE)","v":91},{"$f":"VLOOKUP(X45,Data!$W$2:$BG$33,14,FALSE)","v":345},{"$f":"VLOOKUP(X45,Data!$W$2:$BG$33,20,FALSE)","v":291},{"$f":"VLOOKUP(X45,Data!$W$2:$BG$33,26,FALSE)","v":76},{"$f":"VLOOKUP(X45,Data!$W$2:$BG$33,32,FALSE)","v":9},null,null,null,0,{"$f":"VLOOKUP(AR44,Data!$W$2:$BG$33,2,FALSE)","v":22},{"$f":"VLOOKUP(AR44,Data!$W$2:$BG$33,8,FALSE)","v":8},{"$f":"VLOOKUP(AR44,Data!$W$2:$BG$33,14,FALSE)","v":2},{"$f":"VLOOKUP(AR44,Data!$W$2:$BG$33,20,FALSE)","v":0},{"$f":"VLOOKUP(AR44,Data!$W$2:$BG$33,26,FALSE)","v":0},{"$f":"VLOOKUP(AR44,Data!$W$2:$BG$33,32,FALSE)","v":0},null,null,null,0,{"$f":"VLOOKUP(AR45,Data!$W$2:$BG$33,2,FALSE)","v":48},{"$f":"VLOOKUP(AR45,Data!$W$2:$BG$33,8,FALSE)","v":279},{"$f":"VLOOKUP(AR45,Data!$W$2:$BG$33,14,FALSE)","v":271},{"$f":"VLOOKUP(AR45,Data!$W$2:$BG$33,20,FALSE)","v":45},{"$f":"VLOOKUP(AR45,Data!$W$2:$BG$33,26,FALSE)","v":1},{"$f":"VLOOKUP(AR45,Data!$W$2:$BG$33,32,FALSE)","v":0}]
[null,null,null,null,1,{"$f":"VLOOKUP(D44,Data!$W$2:$BG$33,3,FALSE)","v":24},{"$f":"VLOOKUP(D44,Data!$W$2:$BG$33,9,FALSE)","v":121},{"$f":"VLOOKUP(D44,Data!$W$2:$BG$33,15,FALSE)","v":260},{"$f":"VLOOKUP(D44,Data!$W$2:$BG$33,21,FALSE)","v":94},{"$f":"VLOOKUP(D44,Data!$W$2:$BG$33,27,FALSE)","v":7},{"$f":"VLOOKUP(D44,Data!$W$2:$BG$33,33,FALSE)","v":0},null,null,null,1,{"$f":"VLOOKUP(D45,Data!$W$2:$BG$33,3,FALSE)","v":212},{"$f":"VLOOKUP(D45,Data!$W$2:$BG$33,9,FALSE)","v":186},{"$f":"VLOOKUP(D45,Data!$W$2:$BG$33,15,FALSE)","v":45},{"$f":"VLOOKUP(D45,Data!$W$2:$BG$33,21,FALSE)","v":1},{"$f":"VLOOKUP(D45,Data!$W$2:$BG$33,27,FALSE)","v":0},{"$f":"VLOOKUP(D45,Data!$W$2:$BG$33,33,FALSE)","v":0},null,null,null,1,{"$f":"VLOOKUP(X44,Data!$W$2:$BG$33,3,FALSE)","v":47},{"$f":"VLOOKUP(X44,Data!$W$2:$BG$33,9,FALSE)","v":262},{"$f":"VLOOKUP(X44,Data!$W$2:$BG$33,15,FALSE)","v":235},{"$f":"VLOOKUP(X44,Data!$W$2:$BG$33,21,FALSE)","v":31},{"$f":"VLOOKUP(X44,Data!$W$2:$BG$33,27,FALSE)","v":3},{"$f":"VLOOKUP(X44,Data!$W$2:$BG$33,33,FALSE)","v":0},null,null,null,1,{"$f":"VLOOKUP(X45,Data!$W$2:$BG$33,3,FALSE)","v":3},{"$f":"VLOOKUP(X45,Data!$W$2:$BG$33,9,FALSE)","v":17},{"$f":"VLOOKUP(X45,Data!$W$2:$BG$33,15,FALSE)","v":80},{"$f":"VLOOKUP(X45,Data!$W$2:$BG$33,21,FALSE)","v":126},{"$f":"VLOOKUP(X45,Data!$W$2:$BG$33,27,FALSE)","v":45},{"$f":"VLOOKUP(X45,Data!$W$2:$BG$33,33,FALSE)","v":1},null,null,null,1,{"$f":"VLOOKUP(AR44,Data!$W$2:$BG$33,3,FALSE)","v":134},{"$f":"VLOOKUP(AR44,Data!$W$2:$BG$33,9,FALSE)","v":89},{"$f":"VLOOKUP(AR44,Data!$W$2:$BG$33,15,FALSE)","v":8},{"$f":"VLOOKUP(AR44,Data!$W$2:$BG$33,21,FALSE)","v":1},{"$f":"VLOOKUP(AR44,Data!$W$2:$BG$33,27,FALSE)","v":0},{"$f":"VLOOKUP(AR44,Data!$W$2:$BG$33,33,FALSE)","v":0},null,null,null,1,{"$f":"VLOOKUP(AR45,Data!$W$2:$BG$33,3,FALSE)","v":26},{"$f":"VLOOKUP(AR45,Data!$W$2:$BG$33,9,FALSE)","v":135},{"$f":"VLOOKUP(AR45,Data!$W$2:$BG$33,15,FALSE)","v":178},{"$f":"VLOOKUP(AR45,Data!$W$2:$BG$33,21,FALSE)","v":37},{"$f":"VLOOKUP(AR45,Data!$W$2:$BG$33,27,FALSE)","v":1},{"$f":"VLOOKUP(AR45,Data!$W$2:$BG$33,33,FALSE)","v":1}]
[null,null,null,null,2,{"$f":"VLOOKUP(D44,Data!$W$2:$BG$33,4,FALSE)","v":1},{"$f":"VLOOKUP(D44,Data!$W$2:$BG$33,10,FALSE)","v":23},{"$f":"VLOOKUP(D44,Data!$W$2:$BG$33,16,FALSE)","v":42},{"$f":"VLOOKUP(D44,Data!$W$2:$BG$33,22,FALSE)","v":33},{"$f":"VLOOKUP(D44,Data!$W$2:$BG$33,28,FALSE)","v":2},{"$f":"VLOOKUP(D44,Data!$W$2:$BG$33,34,FALSE)","v":0},null,null,null,2,{"$f":"VLOOKUP(D45,Data!$W$2:$BG$33,4,FALSE)","v":117},{"$f":"VLOOKUP(D45,Data!$W$2:$BG$33,10,FALSE)","v":133},{"$f":"VLOOKUP(D45,Data!$W$2:$BG$33,16,FALSE)","v":30},{"$f":"VLOOKUP(D45,Data!$W$2:$BG$33,22,FALSE)","v":3},{"$f":"VLOOKUP(D45,Data!$W$2:$BG$33,28,FALSE)","v":1},{"$f":"VLOOKUP(D45,Data!$W$2:$BG$33,34,FALSE)","v":0},null,null,null,2,{"$f":"VLOOKUP(X44,Data!$W$2:$BG$33,4,FALSE)","v":11},{"$f":"VLOOKUP(X44,Data!$W$2:$BG$33,10,FALSE)","v":53},{"$f":"VLOOKUP(X44,Data!$W$2:$BG$33,16,FALSE)","v":59},{"$f":"VLOOKUP(X44,Data!$W$2:$BG$33,22,FALSE)","v":10},{"$f":"VLOOKUP(X44,Data!$W$2:$BG$33,28,FALSE)","v":0},{"$f":"VLOOKUP(X44,Data!$W$2:$BG$33,34,FALSE)","v":0},null,null,null,2,{"$f":"VLOOKUP(X45,Data!$W$2:$BG$33,4,FALSE)","v":0},{"$f":"VLOOKUP(X45,Data!$W$2:$BG$33,10,FALSE)","v":7},{"$f":"VLOOKUP(X45,Data!$W$2:$BG$33,16,FALSE)","v":3},{"$f":"VLOOKUP(X45,Data!$W$2:$BG$33,22,FALSE)","v":3},{"$f":"VLOOKUP(X45,Data!$W$2:$BG$33,28,FALSE)","v":2},{"$f":"VLOOKUP(X45,Data!$W$2:$BG$33,34,FALSE)","v":0},null,null,null,2,{"$f":"VLOOKUP(AR44,Data!$W$2:$BG$33,4,FALSE)","v":239},{"$f":"VLOOKUP(AR44,Data!$W$2:$BG$33,10,FALSE)","v":286},{"$f":"VLOOKUP(AR44,Data!$W$2:$BG$33,16,FALSE)","v":28},{"$f":"VLOOKUP(AR44,Data!$W$2:$BG$33,22,FALSE)","v":2},{"$f":"VLOOKUP(AR44,Data!$W$2:$BG$33,28,FALSE)","v":0},{"$f":"VLOOKUP(AR44,Data!$W$2:$BG$33,34,FALSE)","v":0},null,null,null,2,{"$f":"VLOOKUP(AR45,Data!$W$2:$BG$33,4,FALSE)","v":1},{"$f":"VLOOKUP(AR45,Data!$W$2:$BG$33,10,FALSE)","v":18},{"$f":"VLOOKUP(AR45,Data!$W$2:$BG$33,16,FALSE)","v":35},{"$f":"VLOOKUP(AR45,Data!$W$2:$BG$33,22,FALSE)","v":13},{"$f":"VLOOKUP(AR45,Data!$W$2:$BG$33,28,FALSE)","v":0},{"$f":"VLOOKUP(AR45,Data!$W$2:$BG$33,34,FALSE)","v":1}]
[null,null,null,null,3,{"$f":"VLOOKUP(D44,Data!$W$2:$BG$33,5,FALSE)","v":0},{"$f":"VLOOKUP(D44,Data!$W$2:$BG$33,11,FALSE)","v":2},{"$f":"VLOOKUP(D44,Data!$W$2:$BG$33,17,FALSE)","v":4},{"$f":"VLOOKUP(D44,Data!$W$2:$BG$33,23,FALSE)","v":0},{"$f":"VLOOKUP(D44,Data!$W$2:$BG$33,29,FALSE)","v":1},{"$f":"VLOOKUP(D44,Data!$W$2:$BG$33,35,FALSE)","v":0},null,null,null,3,{"$f":"VLOOKUP(D45,Data!$W$2:$BG$33,5,FALSE)","v":12},{"$f":"VLOOKUP(D45,Data!$W$2:$BG$33,11,FALSE)","v":32},{"$f":"VLOOKUP(D45,Data!$W$2:$BG$33,17,FALSE)","v":5},{"$f":"VLOOKUP(D45,Data!$W$2:$BG$33,23,FALSE)","v":1},{"$f":"VLOOKUP(D45,Data!$W$2:$BG$33,29,FALSE)","v":0},{"$f":"VLOOKUP(D45,Data!$W$2:$BG$33,35,FALSE)","v":1},null,null,null,3,{"$f":"VLOOKUP(X44,Data!$W$2:$BG$33,5,FALSE)","v":0},{"$f":"VLOOKUP(X44,Data!$W$2:$BG$33,11,FALSE)","v":5},{"$f":"VLOOKUP(X44,Data!$W$2:$BG$33,17,FALSE)","v":4},{"$f":"VLOOKUP(X44,Data!$W$2:$BG$33,23,FALSE)","v":0},{"$f":"VLOOKUP(X44,Data!$W$2:$BG$33,29,FALSE)","v":0},{"$f":"VLOOKUP(X44,Data!$W$2:$BG$33,35,FALSE)","v":0},null,null,null,3,{"$f":"VLOOKUP(X45,Data!$W$2:$BG$33,5,FALSE)","v":0},{"$f":"VLOOKUP(X45,Data!$W$2:$BG$33,11,FALSE)","v":1},{"$f":"VLOOKUP(X45,Data!$W$2:$BG$33,17,FALSE)","v":2},{"$f":"VLOOKUP(X45,Data!$W$2:$BG$33,23,FALSE)","v":0},{"$f":"VLOOKUP(X45,Data!$W$2:$BG$33,29,FALSE)","v":1},{"$f":"VLOOKUP(X45,Data!$W$2:$BG$33,35,FALSE)","v":0},null,null,null,3,{"$f":"VLOOKUP(AR44,Data!$W$2:$BG$33,5,FALSE)","v":76},{"$f":"VLOOKUP(AR44,Data!$W$2:$BG$33,11,FALSE)","v":134},{"$f":"VLOOKUP(AR44,Data!$W$2:$BG$33,17,FALSE)","v":22},{"$f":"VLOOKUP(AR44,Data!$W$2:$BG$33,23,FALSE)","v":0},{"$f":"VLOOKUP(AR44,Data!$W$2:$BG$33,29,FALSE)","v":0},{"$f":"VLOOKUP(AR44,Data!$W$2:$BG$33,35,FALSE)","v":2},null,null,null,3,{"$f":"VLOOKUP(AR45,Data!$W$2:$BG$33,5,FALSE)","v":1},{"$f":"VLOOKUP(AR45,Data!$W$2:$BG$33,11,FALSE)","v":1},{"$f":"VLOOKUP(AR45,Data!$W$2:$BG$33,17,FALSE)","v":3},{"$f":"VLOOKUP(AR45,Data!$W$2:$BG$33,23,FALSE)","v":0},{"$f":"VLOOKUP(AR45,Data!$W$2:$BG$33,29,FALSE)","v":1},{"$f":"VLOOKUP(AR45,Data!$W$2:$BG$33,35,FALSE)","v":0}]
[null,null,null,null,4,{"$f":"VLOOKUP(D44,Data!$W$2:$BG$33,6,FALSE)","v":0},{"$f":"VLOOKUP(D44,Data!$W$2:$BG$33,12,FALSE)","v":0},{"$f":"VLOOKUP(D44,Data!$W$2:$BG$33,18,FALSE)","v":0},{"$f":"VLOOKUP(D44,Data!$W$2:$BG$33,24,FALSE)","v":2},{"$f":"VLOOKUP(D44,Data!$W$2:$BG$33,30,FALSE)","v":0},{"$f":"VLOOKUP(D44,Data!$W$2:$BG$33,36,FALSE)","v":0},null,null,null,4,{"$f":"VLOOKUP(D45,Data!$W$2:$BG$33,6,FALSE)","v":1},{"$f":"VLOOKUP(D45,Data!$W$2:$BG$33,12,FALSE)","v":1},{"$f":"VLOOKUP(D45,Data!$W$2:$BG$33,18,FALSE)","v":0},{"$f":"VLOOKUP(D45,Data!$W$2:$BG$33,24,FALSE)","v":0},{"$f":"VLOOKUP(D45,Data!$W$2:$BG$33,30,FALSE)","v":0},{"$f":"VLOOKUP(D45,Data!$W$2:$BG$33,36,FALSE)","v":0},null,null,null,4,{"$f":"VLOOKUP(X44,Data!$W$2:$BG$33,6,FALSE)","v":0},{"$f":"VLOOKUP(X44,Data!$W$2:$BG$33,12,FALSE)","v":0},{"$f":"VLOOKUP(X44,Data!$W$2:$BG$33,18,FALSE)","v":2},{"$f":"VLOOKUP(X44,Data!$W$2:$BG$33,24,FALSE)","v":0},{"$f":"VLOOKUP(X44,Data!$W$2:$BG$33,30,FALSE)","v":0},{"$f":"VLOOKUP(X44,Data!$W$2:$BG$33,36,FALSE)","v":0},null,null,null,4,{"$f":"VLOOKUP(X45,Data!$W$2:$BG$33,6,FALSE)","v":0},{"$f":"VLOOKUP(X45,Data!$W$2:$BG$33,12,FALSE)","v":0},{"$f":"VLOOKUP(X45,Data!$W$2:$BG$33,18,FALSE)","v":0},{"$f":"VLOOKUP(X45,Data!$W$2:$BG$33,24,FALSE)","v":0},{"$f":"VLOOKUP(X45,Data!$W$2:$BG$33,30,FALSE)","v":0},{"$f":"VLOOKUP(X45,Data!$W$2:$BG$33,36,FALSE)","v":0},null,null,null,4,{"$f":"VLOOKUP(AR44,Data!$W$2:$BG$33,6,FALSE)","v":20},{"$f":"VLOOKUP(AR44,Data!$W$2:$BG$33,12,FALSE)","v":17},{"$f":"VLOOKUP(AR44,Data!$W$2:$BG$33,18,FALSE)","v":2},{"$f":"VLOOKUP(AR44,Data!$W$2:$BG$33,24,FALSE)","v":0},{"$f":"VLOOKUP(AR44,Data!$W$2:$BG$33,30,FALSE)","v":0},{"$f":"VLOOKUP(AR44,Data!$W$2:$BG$33,36,FALSE)","v":0},null,null,null,4,{"$f":"VLOOKUP(AR45,Data!$W$2:$BG$33,6,FALSE)","v":0},{"$f":"VLOOKUP(AR45,Data!$W$2:$BG$33,12,FALSE)","v":0},{"$f":"VLOOKUP(AR45,Data!$W$2:$BG$33,18,FALSE)","v":0},{"$f":"VLOOKUP(AR45,Data!$W$2:$BG$33,24,FALSE)","v":0},{"$f":"VLOOKUP(AR45,Data!$W$2:$BG$33,30,FALSE)","v":0},{"$f":"VLOOKUP(AR45,Data!$W$2:$BG$33,36,FALSE)","v":0}]
[null,null,null,null,"4+",{"$f":"VLOOKUP(D44,Data!$W$2:$BG$33,7,FALSE)","v":0},{"$f":"VLOOKUP(D44,Data!$W$2:$BG$33,13,FALSE)","v":0},{"$f":"VLOOKUP(D44,Data!$W$2:$BG$33,19,FALSE)","v":0},{"$f":"VLOOKUP(D44,Data!$W$2:$BG$33,25,FALSE)","v":0},{"$f":"VLOOKUP(D44,Data!$W$2:$BG$33,31,FALSE)","v":1},{"$f":"VLOOKUP(D44,Data!$W$2:$BG$33,37,FALSE)","v":0},null,null,null,"4+",{"$f":"VLOOKUP(D45,Data!$W$2:$BG$33,7,FALSE)","v":1},{"$f":"VLOOKUP(D45,Data!$W$2:$BG$33,13,FALSE)","v":0},{"$f":"VLOOKUP(D45,Data!$W$2:$BG$33,19,FALSE)","v":0},{"$f":"VLOOKUP(D45,Data!$W$2:$BG$33,25,FALSE)","v":0},{"$f":"VLOOKUP(D45,Data!$W$2:$BG$33,31,FALSE)","v":0},{"$f":"VLOOKUP(D45,Data!$W$2:$BG$33,37,FALSE)","v":0},null,null,null,"4+",{"$f":"VLOOKUP(X44,Data!$W$2:$BG$33,7,FALSE)","v":0},{"$f":"VLOOKUP(X44,Data!$W$2:$BG$33,13,FALSE)","v":1},{"$f":"VLOOKUP(X44,Data!$W$2:$BG$33,19,FALSE)","v":1},{"$f":"VLOOKUP(X44,Data!$W$2:$BG$33,25,FALSE)","v":0},{"$f":"VLOOKUP(X44,Data!$W$2:$BG$33,31,FALSE)","v":1},{"$f":"VLOOKUP(X44,Data!$W$2:$BG$33,37,FALSE)","v":0},null,null,null,"4+",{"$f":"VLOOKUP(X45,Data!$W$2:$BG$33,7,FALSE)","v":0},{"$f":"VLOOKUP(X45,Data!$W$2:$BG$33,13,FALSE)","v":0},{"$f":"VLOOKUP(X45,Data!$W$2:$BG$33,19,FALSE)","v":0},{"$f":"VLOOKUP(X45,Data!$W$2:$BG$33,25,FALSE)","v":0},{"$f":"VLOOKUP(X45,Data!$W$2:$BG$33,31,FALSE)","v":1},{"$f":"VLOOKUP(X45,Data!$W$2:$BG$33,37,FALSE)","v":0},null,null,null,"4+",{"$f":"VLOOKUP(AR44,Data!$W$2:$BG$33,7,FALSE)","v":2},{"$f":"VLOOKUP(AR44,Data!$W$2:$BG$33,13,FALSE)","v":1},{"$f":"VLOOKUP(AR44,Data!$W$2:$BG$33,19,FALSE)","v":0},{"$f":"VLOOKUP(AR44,Data!$W$2:$BG$33,25,FALSE)","v":0},{"$f":"VLOOKUP(AR44,Data!$W$2:$BG$33,31,FALSE)","v":0},{"$f":"VLOOKUP(AR44,Data!$W$2:$BG$33,37,FALSE)","v":0},null,null,null,"4+",{"$f":"VLOOKUP(AR45,Data!$W$2:$BG$33,7,FALSE)","v":0},{"$f":"VLOOKUP(AR45,Data!$W$2:$BG$33,13,FALSE)","v":0},{"$f":"VLOOKUP(AR45,Data!$W$2:$BG$33,19,FALSE)","v":0},{"$f":"VLOOKUP(AR45,Data!$W$2:$BG$33,25,FALSE)","v":0},{"$f":"VLOOKUP(AR45,Data!$W$2:$BG$33,31,FALSE)","v":0},{"$f":"VLOOKUP(AR45,Data!$W$2:$BG$33,37,FALSE)","v":0},null,null,{"$f":"SUM(E48:BI54)-120","v":6381}]
[]
[null,null,null,null,"Groupe D"]
[]
[null,null,null,19,{"$f":"VLOOKUP(D58,Data!$B$2:$J$33,7,FALSE)","v":"2012-06-11T18:00:00"},null,null,null,null,null,null,null,null,null,null,null,null,null,null,null,null,null,null,21,{"$f":"VLOOKUP(X58,Data!$B$2:$J$33,7,FALSE)","v":"2012-06-15T18:00:00"},null,null,null,null,null,null,null,null,null,null,null,null,null,null,null,null,null,null,23,{"$f":"VLOOKUP(AR58,Data!$B$2:$J$33,7,FALSE)","v":"2012-06-19T20:45:00"}]
[]
[null,null,null,19,{"$f":"VLOOKUP(D60,Data!$B$2:$J$33,5,FALSE)","v":"France"},null,null,"vs",{"$f":"VLOOKUP(D60,Data!$B$2:$J$33,6,FALSE)","v":"Angleterre"},null,null,null,null,null,{"$f":"VLOOKUP(D61,Data!$B$2:$J$33,5,FALSE)","v":"Ukraine"},null,null,"vs",{"$f":"VLOOKUP(D61,Data!$B$2:$J$33,6,FALSE)","v":"Suède"},null,null,null,null,21,{"$f":"VLOOKUP(X60,Data!$B$2:$J$33,5,FALSE)","v":"Ukraine"},null,null,"vs",{"$f":"VLOOKUP(X60,Data!$B$2:$J$33,6,FALSE)","v":"France"},null,null,null,null,null,{"$f":"VLOOKUP(X61,Data!$B$2:$J$33,5,FALSE)","v":"Suède"},null,null,"vs",{"$f":"VLOOKUP(X61,Data!$B$2:$J$33,6,FALSE)","v":"Angleterre"},null,null,null,null,23,{"$f":"VLOOKUP(AR60,Data!$B$2:$J$33,5,FALSE)","v":"Suède"},null,null,"vs",{"$f":"VLOOKUP(AR60,Data!$B$2:$J$33,6,FALSE)","v":"France"},null,null,null,null,null,{"$f":"VLOOKUP(AR61,Data!$B$2:$J$33,5,FALSE)","v":"Angleterre"},null,null,"vs",{"$f":"VLOOKUP(AR61,Data!$B$2:$J$33,6,FALSE)","v":"Ukraine"}]
[null,null,null,20,{"$f":"VLOOKUP(D60,Data!$B$2:$J$33,2,FALSE)","v":1},null,null,{"$f":"H13","v":"à"},{"$f":"VLOOKUP(D60,Data!$B$2:$J$33,3,FALSE)","v":1},null,null,null,null,null,{"$f":"VLOOKUP(D61,Data!$B$2:$J$33,2,FALSE)","v":2},null,null,{"$f":"H13","v":"à"},{"$f":"VLOOKUP(D61,Data!$B$2:$J$33,3,FALSE)","v":1},null,null,null,null,22,{"$f":"VLOOKUP(X60,Data!$B$2:$J$33,2,FALSE)","v":0},null,null,{"$f":"H13","v":"à"},{"$f":"VLOOKUP(X60,Data!$B$2:$J$33,3,FALSE)","v":2},null,null,null,null,null,{"$f":"VLOOKUP(X61,Data!$B$2:$J$33,2,FALSE)","v":2},null,null,{"$f":"H13","v":"à"},{"$f":"VLOOKUP(X61,Data!$B$2:$J$33,3,FALSE)","v":3},null,null,null,null,24,{"$f":"VLOOKUP(AR60,Data!$B$2:$J$33,2,FALSE)","v":""},null,null,{"$f":"H13","v":"à"},{"$f":"VLOOKUP(AR60,Data!$B$2:$J$33,3,FALSE)","v":""},null,null,null,null,null,{"$f":"VLOOKUP(AR61,Data!$B$2:$J$33,2,FALSE)","v":""},null,null,{"$f":"H13","v":"à"},{"$f":"VLOOKUP(AR61,Data!$B$2:$J$33,3,FALSE)","v":""}]
[null,null,null,null,{"$f":"ROUND((SUM(G65:G70)*G64+SUM(H65:H70)*H64+SUM(I65:I70)*I64+SUM(J65:J70)*J64+SUM(K65:K70)*5)/IF(SUM(F65:K70)=0,1,SUM(F65:K70)),2)","v":1.54},null,null,null,{"$f":"ROUND((SUM(F66:K66)*E66+SUM(F67:K67)*E67+SUM(F68:K68)*E68+SUM(F69:K69)*E69++SUM(F70:K70)*5)/IF(SUM(F65:K70)=0,1,SUM(F65:K70)),2)","v":0.83},null,null,null,null,null,{"$f":"ROUND((SUM(Q65:Q70)*Q64+SUM(R65:R70)*R64+SUM(S65:S70)*S64+SUM(T65:T70)*T64+SUM(U65:U70)*5)/IF(SUM(P65:U70)=0,1,SUM(P65:U70)),2)","v":0.85},null,null,null,{"$f":"ROUND((SUM(P66:U66)*O66+SUM(P67:U67)*O67+SUM(P68:U68)*O68+SUM(P69:U69)*O69++SUM(P70:U70)*5)/IF(SUM(P65:U70)=0,1,SUM(P65:U70)),2)","v":1.18},null,null,null,null,null,{"$f":"ROUND((SUM(AA65:AA70)*AA64+SUM(AB65:AB70)*AB64+SUM(AC65:AC70)*AC64+SUM(AD65:AD70)*AD64+SUM(AE65:AE70)*5)/IF(SUM(Z65:AE70)=0,1,SUM(Z65:AE70)),2)","v":0.53},null,null,null,{"$f":"ROUND((SUM(Z66:AE66)*Y66+SUM(Z67:AE67)*Y67+SUM(Z68:AE68)*Y68+SUM(Z69:AE69)*Y69++SUM(Z70:AE70)*5)/IF(SUM(Z65:AE70)=0,1,SUM(Z65:AE70)),2)","v":1.75},null,null,null,null,null,{"$f":"ROUND((SUM(AK65:AK70)*AK64+SUM(AL65:AL70)*AL64+SUM(AM65:AM70)*AM64+SUM(AN65:AN70)*AN64+SUM(AO65:AO70)*5)/IF(SUM(AJ65:AO70)=0,1,SUM(AJ65:AO70)),2)","v":0.87},null,null,null,{"$f":"ROUND((SUM(AJ66:AO66)*AI66+SUM(AJ67:AO67)*AI67+SUM(AJ68:AO68)*AI68+SUM(AJ69:AO69)*AI69++SUM(AJ70:AO70)*5)/IF(SUM(AJ65:AO70)=0,1,SUM(AJ65:AO70)),2)","v":1.48},null,null,null,null,null,{"$f":"ROUND((SUM(AU65:AU70)*AU64+SUM(AV65:AV70)*AV64+SUM(AW65:AW70)*AW64+SUM(AX65:AX70)*AX64+SUM(AY65:AY70)*5)/IF(SUM(AT65:AY70)=0,1,SUM(AT65:AY70)),2)","v":0.79},null,null,null,{"$f":"ROUND((SUM(AT66:AY66)*AS66+SUM(AT67:AY67)*AS67+SUM(AT68:AY68)*AS68+SUM(AT69:AY69)*AS69++SUM(AT70:AY70)*5)/IF(SUM(AT65:AY70)=0,1,SUM(AT65:AY70)),2)","v":1.58},null,null,null,null,null,{"$f":"ROUND((SUM(BE65:BE70)*BE64+SUM(BF65:BF70)*BF64+SUM(BG65:BG70)*BG64+SUM(BH65:BH70)*BH64+SUM(BI65:BI70)*5)/IF(SUM(BD65:BI70)=0,1,SUM(BD65:BI70)),2)","v":1.67},null,null,null,{"$f":"ROUND((SUM(BD66:BI66)*BC66+SUM(BD67:BI67)*BC67+SUM(BD68:BI68)*BC68+SUM(BD69:BI69)*BC69++SUM(BD70:BI70)*5)/IF(SUM(BD65:BI70)=0,1,SUM(BD65:BI70)),2)","v":0.6}]
[null,null,null,null,null,null,null,null,null,null,null,null,null,null,{"$f":"O60","v":"Ukraine"},null,null,null,null,null,null,null,null,null,{"$f":"Y60","v":"Ukraine"},null,null,null,null,null,null,null,null,null,{"$f":"AI60","v":"Suède"},null,null,null,null,null,null,null,null,null,{"$f":"AS60","v":"Suède"},null,null,null,null,null,null,null,null,null,{"$f":"BC60","v":"Angleterre"}]
[null,null,{"$f":"I60","v":"Angleterre"},null,null,0,1,2,3,4,"4+",null,null,{"$f":"S60","v":"Suède"},null,0,1,2,3,4,"4+",null,{"$f":"AC60","v":"France"},null,null,0,1,2,3,4,"4+",null,null,{"$f":"AM60","v":"Angleterre"},null,0,1,2,3,4,"4+",null,{"$f":"AW60","v":"France"},null,null,0,1,2,3,4,"4+",null,null,{"$f":"BG60","v":"Ukraine"},null,0,1,2,3,4,"4+"]
[null,null,null,null,0,{"$f":"VLOOKUP(D60,Data!$W$2:$BG$33,2,FALSE)","v":40},{"$f":"VLOOKUP(D60,Data!$W$2:$BG$33,8,FALSE)","v":150},{"$f":"VLOOKUP(D60,Data!$W$2:$BG$33,14,FALSE)","v":154},{"$f":"VLOOKUP(D60,Data!$W$2:$BG$33,20,FALSE)","v":6},{"$f":"VLOOKUP(D60,Data!$W$2:$BG$33,26,FALSE)","v":0},{"$f":"VLOOKUP(D60,Data!$W$2:$BG$33,32,FALSE)","v":1},null,null,null,0,{"$f":"VLOOKUP(D61,Data!$W$2:$BG$33,2,FALSE)","v":67},{"$f":"VLOOKUP(D61,Data!$W$2:$BG$33,8,FALSE)","v":109},{"$f":"VLOOKUP(D61,Data!$W$2:$BG$33,14,FALSE)","v":38},{"$f":"VLOOKUP(D61,Data!$W$2:$BG$33,20,FALSE)","v":2},{"$f":"VLOOKUP(D61,Data!$W$2:$BG$33,26,FALSE)","v":0},{"$f":"VLOOKUP(D61,Data!$W$2:$BG$33,32,FALSE)","v":0},null,null,null,0,{"$f":"VLOOKUP(X60,Data!$W$2:$BG$33,2,FALSE)","v":31},{"$f":"VLOOKUP(X60,Data!$W$2:$BG$33,8,FALSE)","v":9},{"$f":"VLOOKUP(X60,Data!$W$2:$BG$33,14,FALSE)","v":5},{"$f":"VLOOKUP(X60,Data!$W$2:$BG$33,20,FALSE)","v":1},{"$f":"VLOOKUP(X60,Data!$W$2:$BG$33,26,FALSE)","v":0},{"$f":"VLOOKUP(X60,Data!$W$2:$BG$33,32,FALSE)","v":0},null,null,null,0,{"$f":"VLOOKUP(X61,Data!$W$2:$BG$33,2,FALSE)","v":40},{"$f":"VLOOKUP(X61,Data!$W$2:$BG$33,8,FALSE)","v":51},{"$f":"VLOOKUP(X61,Data!$W$2:$BG$33,14,FALSE)","v":19},{"$f":"VLOOKUP(X61,Data!$W$2:$BG$33,20,FALSE)","v":2},{"$f":"VLOOKUP(X61,Data!$W$2:$BG$33,26,FALSE)","v":0},{"$f":"VLOOKUP(X61,Data!$W$2:$BG$33,32,FALSE)","v":0},null,null,null,0,{"$f":"VLOOKUP(AR60,Data!$W$2:$BG$33,2,FALSE)","v":40},{"$f":"VLOOKUP(AR60,Data!$W$2:$BG$33,8,FALSE)","v":27},{"$f":"VLOOKUP(AR60,Data!$W$2:$BG$33,14,FALSE)","v":7},{"$f":"VLOOKUP(AR60,Data!$W$2:$BG$33,20,FALSE)","v":0},{"$f":"VLOOKUP(AR60,Data!$W$2:$BG$33,26,FALSE)","v":1},{"$f":"VLOOKUP(AR60,Data!$W$2:$BG$33,32,FALSE)","v":0},null,null,null,0,{"$f":"VLOOKUP(AR61,Data!$W$2:$BG$33,2,FALSE)","v":33},{"$f":"VLOOKUP(AR61,Data!$W$2:$BG$33,8,FALSE)","v":234},{"$f":"VLOOKUP(AR61,Data!$W$2:$BG$33,14,FALSE)","v":243},{"$f":"VLOOKUP(AR61,Data!$W$2:$BG$33,20,FALSE)","v":60},{"$f":"VLOOKUP(AR61,Data!$W$2:$BG$33,26,FALSE)","v":2},{"$f":"VLOOKUP(AR61,Data!$W$2:$BG$33,32,FALSE)","v":0}]
[null,null,null,null,1,{"$f":"VLOOKUP(D60,Data!$W$2:$BG$33,3,FALSE)","v":28},{"$f":"VLOOKUP(D60,Data!$W$2:$BG$33,9,FALSE)","v":187},{"$f":"VLOOKUP(D60,Data!$W$2:$BG$33,15,FALSE)","v":315},{"$f":"VLOOKUP(D60,Data!$W$2:$BG$33,21,FALSE)","v":37},{"$f":"VLOOKUP(D60,Data!$W$2:$BG$33,27,FALSE)","v":2},{"$f":"VLOOKUP(D60,Data!$W$2:$BG$33,33,FALSE)","v":0},null,null,null,1,{"$f":"VLOOKUP(D61,Data!$W$2:$BG$33,3,FALSE)","v":152},{"$f":"VLOOKUP(D61,Data!$W$2:$BG$33,9,FALSE)","v":284},{"$f":"VLOOKUP(D61,Data!$W$2:$BG$33,15,FALSE)","v":74},{"$f":"VLOOKUP(D61,Data!$W$2:$BG$33,21,FALSE)","v":5},{"$f":"VLOOKUP(D61,Data!$W$2:$BG$33,27,FALSE)","v":1},{"$f":"VLOOKUP(D61,Data!$W$2:$BG$33,33,FALSE)","v":0},null,null,null,1,{"$f":"VLOOKUP(X60,Data!$W$2:$BG$33,3,FALSE)","v":231},{"$f":"VLOOKUP(X60,Data!$W$2:$BG$33,9,FALSE)","v":131},{"$f":"VLOOKUP(X60,Data!$W$2:$BG$33,15,FALSE)","v":13},{"$f":"VLOOKUP(X60,Data!$W$2:$BG$33,21,FALSE)","v":1},{"$f":"VLOOKUP(X60,Data!$W$2:$BG$33,27,FALSE)","v":0},{"$f":"VLOOKUP(X60,Data!$W$2:$BG$33,33,FALSE)","v":1},null,null,null,1,{"$f":"VLOOKUP(X61,Data!$W$2:$BG$33,3,FALSE)","v":168},{"$f":"VLOOKUP(X61,Data!$W$2:$BG$33,9,FALSE)","v":216},{"$f":"VLOOKUP(X61,Data!$W$2:$BG$33,15,FALSE)","v":73},{"$f":"VLOOKUP(X61,Data!$W$2:$BG$33,21,FALSE)","v":2},{"$f":"VLOOKUP(X61,Data!$W$2:$BG$33,27,FALSE)","v":1},{"$f":"VLOOKUP(X61,Data!$W$2:$BG$33,33,FALSE)","v":0},null,null,null,1,{"$f":"VLOOKUP(AR60,Data!$W$2:$BG$33,3,FALSE)","v":176},{"$f":"VLOOKUP(AR60,Data!$W$2:$BG$33,9,FALSE)","v":262},{"$f":"VLOOKUP(AR60,Data!$W$2:$BG$33,15,FALSE)","v":20},{"$f":"VLOOKUP(AR60,Data!$W$2:$BG$33,21,FALSE)","v":3},{"$f":"VLOOKUP(AR60,Data!$W$2:$BG$33,27,FALSE)","v":1},{"$f":"VLOOKUP(AR60,Data!$W$2:$BG$33,33,FALSE)","v":0},null,null,null,1,{"$f":"VLOOKUP(AR61,Data!$W$2:$BG$33,3,FALSE)","v":24},{"$f":"VLOOKUP(AR61,Data!$W$2:$BG$33,9,FALSE)","v":121},{"$f":"VLOOKUP(AR61,Data!$W$2:$BG$33,15,FALSE)","v":183},{"$f":"VLOOKUP(AR61,Data!$W$2:$BG$33,21,FALSE)","v":76},{"$f":"VLOOKUP(AR61,Data!$W$2:$BG$33,27,FALSE)","v":5},{"$f":"VLOOKUP(AR61,Data!$W$2:$BG$33,33,FALSE)","v":2}]
[null,null,null,null,2,{"$f":"VLOOKUP(D60,Data!$W$2:$BG$33,4,FALSE)","v":16},{"$f":"VLOOKUP(D60,Data!$W$2:$BG$33,10,FALSE)","v":52},{"$f":"VLOOKUP(D60,Data!$W$2:$BG$33,16,FALSE)","v":48},{"$f":"VLOOKUP(D60,Data!$W$2:$BG$33,22,FALSE)","v":11},{"$f":"VLOOKUP(D60,Data!$W$2:$BG$33,28,FALSE)","v":3},{"$f":"VLOOKUP(D60,Data!$W$2:$BG$33,34,FALSE)","v":0},null,null,null,2,{"$f":"VLOOKUP(D61,Data!$W$2:$BG$33,4,FALSE)","v":104},{"$f":"VLOOKUP(D61,Data!$W$2:$BG$33,10,FALSE)","v":146},{"$f":"VLOOKUP(D61,Data!$W$2:$BG$33,16,FALSE)","v":28},{"$f":"VLOOKUP(D61,Data!$W$2:$BG$33,22,FALSE)","v":4},{"$f":"VLOOKUP(D61,Data!$W$2:$BG$33,28,FALSE)","v":0},{"$f":"VLOOKUP(D61,Data!$W$2:$BG$33,34,FALSE)","v":1},null,null,null,2,{"$f":"VLOOKUP(X60,Data!$W$2:$BG$33,4,FALSE)","v":271},{"$f":"VLOOKUP(X60,Data!$W$2:$BG$33,10,FALSE)","v":216},{"$f":"VLOOKUP(X60,Data!$W$2:$BG$33,16,FALSE)","v":20},{"$f":"VLOOKUP(X60,Data!$W$2:$BG$33,22,FALSE)","v":0},{"$f":"VLOOKUP(X60,Data!$W$2:$BG$33,28,FALSE)","v":0},{"$f":"VLOOKUP(X60,Data!$W$2:$BG$33,34,FALSE)","v":1},null,null,null,2,{"$f":"VLOOKUP(X61,Data!$W$2:$BG$33,4,FALSE)","v":138},{"$f":"VLOOKUP(X61,Data!$W$2:$BG$33,10,FALSE)","v":225},{"$f":"VLOOKUP(X61,Data!$W$2:$BG$33,16,FALSE)","v":80},{"$f":"VLOOKUP(X61,Data!$W$2:$BG$33,22,FALSE)","v":4},{"$f":"VLOOKUP(X61,Data!$W$2:$BG$33,28,FALSE)","v":1},{"$f":"VLOOKUP(X61,Data!$W$2:$BG$33,34,FALSE)","v":0},null,null,null,2,{"$f":"VLOOKUP(AR60,Data!$W$2:$BG$33,4,FALSE)","v":118},{"$f":"VLOOKUP(AR60,Data!$W$2:$BG$33,10,FALSE)","v":254},{"$f":"VLOOKUP(AR60,Data!$W$2:$BG$33,16,FALSE)","v":53},{"$f":"VLOOKUP(AR60,Data!$W$2:$BG$33,22,FALSE)","v":1},{"$f":"VLOOKUP(AR60,Data!$W$2:$BG$33,28,FALSE)","v":0},{"$f":"VLOOKUP(AR60,Data!$W$2:$BG$33,34,FALSE)","v":0},null,null,null,2,{"$f":"VLOOKUP(AR61,Data!$W$2:$BG$33,4,FALSE)","v":11},{"$f":"VLOOKUP(AR61,Data!$W$2:$BG$33,10,FALSE)","v":41},{"$f":"VLOOKUP(AR61,Data!$W$2:$BG$33,16,FALSE)","v":41},{"$f":"VLOOKUP(AR61,Data!$W$2:$BG$33,22,FALSE)","v":10},{"$f":"VLOOKUP(AR61,Data!$W$2:$BG$33,28,FALSE)","v":1},{"$f":"VLOOKUP(AR61,Data!$W$2:$BG$33,34,FALSE)","v":0}]
[null,null,null,null,3,{"$f":"VLOOKUP(D60,Data!$W$2:$BG$33,5,FALSE)","v":1},{"$f":"VLOOKUP(D60,Data!$W$2:$BG$33,11,FALSE)","v":3},{"$f":"VLOOKUP(D60,Data!$W$2:$BG$33,17,FALSE)","v":2},{"$f":"VLOOKUP(D60,Data!$W$2:$BG$33,23,FALSE)","v":3},{"$f":"VLOOKUP(D60,Data!$W$2:$BG$33,29,FALSE)","v":0},{"$f":"VLOOKUP(D60,Data!$W$2:$BG$33,35,FALSE)","v":0},null,null,null,3,{"$f":"VLOOKUP(D61,Data!$W$2:$BG$33,5,FALSE)","v":13},{"$f":"VLOOKUP(D61,Data!$W$2:$BG$33,11,FALSE)","v":34},{"$f":"VLOOKUP(D61,Data!$W$2:$BG$33,17,FALSE)","v":7},{"$f":"VLOOKUP(D61,Data!$W$2:$BG$33,23,FALSE)","v":0},{"$f":"VLOOKUP(D61,Data!$W$2:$BG$33,29,FALSE)","v":0},{"$f":"VLOOKUP(D61,Data!$W$2:$BG$33,35,FALSE)","v":0},null,null,null,3,{"$f":"VLOOKUP(X60,Data!$W$2:$BG$33,5,FALSE)","v":60},{"$f":"VLOOKUP(X60,Data!$W$2:$BG$33,11,FALSE)","v":104},{"$f":"VLOOKUP(X60,Data!$W$2:$BG$33,17,FALSE)","v":14},{"$f":"VLOOKUP(X60,Data!$W$2:$BG$33,23,FALSE)","v":0},{"$f":"VLOOKUP(X60,Data!$W$2:$BG$33,29,FALSE)","v":0},{"$f":"VLOOKUP(X60,Data!$W$2:$BG$33,35,FALSE)","v":1},null,null,null,3,{"$f":"VLOOKUP(X61,Data!$W$2:$BG$33,5,FALSE)","v":19},{"$f":"VLOOKUP(X61,Data!$W$2:$BG$33,11,FALSE)","v":51},{"$f":"VLOOKUP(X61,Data!$W$2:$BG$33,17,FALSE)","v":18},{"$f":"VLOOKUP(X61,Data!$W$2:$BG$33,23,FALSE)","v":2},{"$f":"VLOOKUP(X61,Data!$W$2:$BG$33,29,FALSE)","v":0},{"$f":"VLOOKUP(X61,Data!$W$2:$BG$33,35,FALSE)","v":0},null,null,null,3,{"$f":"VLOOKUP(AR60,Data!$W$2:$BG$33,5,FALSE)","v":18},{"$f":"VLOOKUP(AR60,Data!$W$2:$BG$33,11,FALSE)","v":87},{"$f":"VLOOKUP(AR60,Data!$W$2:$BG$33,17,FALSE)","v":24},{"$f":"VLOOKUP(AR60,Data!$W$2:$BG$33,23,FALSE)","v":2},{"$f":"VLOOKUP(AR60,Data!$W$2:$BG$33,29,FALSE)","v":0},{"$f":"VLOOKUP(AR60,Data!$W$2:$BG$33,35,FALSE)","v":0},null,null,null,3,{"$f":"VLOOKUP(AR61,Data!$W$2:$BG$33,5,FALSE)","v":1},{"$f":"VLOOKUP(AR61,Data!$W$2:$BG$33,11,FALSE)","v":6},{"$f":"VLOOKUP(AR61,Data!$W$2:$BG$33,17,FALSE)","v":4},{"$f":"VLOOKUP(AR61,Data!$W$2:$BG$33,23,FALSE)","v":0},{"$f":"VLOOKUP(AR61,Data!$W$2:$BG$33,29,FALSE)","v":2},{"$f":"VLOOKUP(AR61,Data!$W$2:$BG$33,35,FALSE)","v":0}]
[null,null,null,null,4,{"$f":"VLOOKUP(D60,Data!$W$2:$BG$33,6,FALSE)","v":0},{"$f":"VLOOKUP(D60,Data!$W$2:$BG$33,12,FALSE)","v":2},{"$f":"VLOOKUP(D60,Data!$W$2:$BG$33,18,FALSE)","v":2},{"$f":"VLOOKUP(D60,Data!$W$2:$BG$33,24,FALSE)","v":1},{"$f":"VLOOKUP(D60,Data!$W$2:$BG$33,30,FALSE)","v":0},{"$f":"VLOOKUP(D60,Data!$W$2:$BG$33,36,FALSE)","v":0},null,null,null,4,{"$f":"VLOOKUP(D61,Data!$W$2:$BG$33,6,FALSE)","v":1},{"$f":"VLOOKUP(D61,Data!$W$2:$BG$33,12,FALSE)","v":2},{"$f":"VLOOKUP(D61,Data!$W$2:$BG$33,18,FALSE)","v":0},{"$f":"VLOOKUP(D61,Data!$W$2:$BG$33,24,FALSE)","v":0},{"$f":"VLOOKUP(D61,Data!$W$2:$BG$33,30,FALSE)","v":0},{"$f":"VLOOKUP(D61,Data!$W$2:$BG$33,36,FALSE)","v":0},null,null,null,4,{"$f":"VLOOKUP(X60,Data!$W$2:$BG$33,6,FALSE)","v":1},{"$f":"VLOOKUP(X60,Data!$W$2:$BG$33,12,FALSE)","v":4},{"$f":"VLOOKUP(X60,Data!$W$2:$BG$33,18,FALSE)","v":0},{"$f":"VLOOKUP(X60,Data!$W$2:$BG$33,24,FALSE)","v":0},{"$f":"VLOOKUP(X60,Data!$W$2:$BG$33,30,FALSE)","v":0},{"$f":"VLOOKUP(X60,Data!$W$2:$BG$33,36,FALSE)","v":0},null,null,null,4,{"$f":"VLOOKUP(X61,Data!$W$2:$BG$33,6,FALSE)","v":0},{"$f":"VLOOKUP(X61,Data!$W$2:$BG$33,12,FALSE)","v":1},{"$f":"VLOOKUP(X61,Data!$W$2:$BG$33,18,FALSE)","v":4},{"$f":"VLOOKUP(X61,Data!$W$2:$BG$33,24,FALSE)","v":0},{"$f":"VLOOKUP(X61,Data!$W$2:$BG$33,30,FALSE)","v":0},{"$f":"VLOOKUP(X61,Data!$W$2:$BG$33,36,FALSE)","v":1},null,null,null,4,{"$f":"VLOOKUP(AR60,Data!$W$2:$BG$33,6,FALSE)","v":1},{"$f":"VLOOKUP(AR60,Data!$W$2:$BG$33,12,FALSE)","v":3},{"$f":"VLOOKUP(AR60,Data!$W$2:$BG$33,18,FALSE)","v":3},{"$f":"VLOOKUP(AR60,Data!$W$2:$BG$33,24,FALSE)","v":0},{"$f":"VLOOKUP(AR60,Data!$W$2:$BG$33,30,FALSE)","v":0},{"$f":"VLOOKUP(AR60,Data!$W$2:$BG$33,36,FALSE)","v":0},null,null,null,4,{"$f":"VLOOKUP(AR61,Data!$W$2:$BG$33,6,FALSE)","v":0},{"$f":"VLOOKUP(AR61,Data!$W$2:$BG$33,12,FALSE)","v":0},{"$f":"VLOOKUP(AR61,Data!$W$2:$BG$33,18,FALSE)","v":0},{"$f":"VLOOKUP(AR61,Data!$W$2:$BG$33,24,FALSE)","v":0},{"$f":"VLOOKUP(AR61,Data!$W$2:$BG$33,30,FALSE)","v":0},{"$f":"VLOOKUP(AR61,Data!$W$2:$BG$33,36,FALSE)","v":0}]
[null,null,null,null,"4+",{"$f":"VLOOKUP(D60,Data!$W$2:$BG$33,7,FALSE)","v":0},{"$f":"VLOOKUP(D60,Data!$W$2:$BG$33,13,FALSE)","v":0},{"$f":"VLOOKUP(D60,Data!$W$2:$BG$33,19,FALSE)","v":0},{"$f":"VLOOKUP(D60,Data!$W$2:$BG$33,25,FALSE)","v":0},{"$f":"VLOOKUP(D60,Data!$W$2:$BG$33,31,FALSE)","v":0},{"$f":"VLOOKUP(D60,Data!$W$2:$BG$33,37,FALSE)","v":1},null,null,null,"4+",{"$f":"VLOOKUP(D61,Data!$W$2:$BG$33,7,FALSE)","v":0},{"$f":"VLOOKUP(D61,Data!$W$2:$BG$33,13,FALSE)","v":0},{"$f":"VLOOKUP(D61,Data!$W$2:$BG$33,19,FALSE)","v":0},{"$f":"VLOOKUP(D61,Data!$W$2:$BG$33,25,FALSE)","v":0},{"$f":"VLOOKUP(D61,Data!$W$2:$BG$33,31,FALSE)","v":0},{"$f":"VLOOKUP(D61,Data!$W$2:$BG$33,37,FALSE)","v":1},null,null,null,"4+",{"$f":"VLOOKUP(X60,Data!$W$2:$BG$33,7,FALSE)","v":0},{"$f":"VLOOKUP(X60,Data!$W$2:$BG$33,13,FALSE)","v":0},{"$f":"VLOOKUP(X60,Data!$W$2:$BG$33,19,FALSE)","v":0},{"$f":"VLOOKUP(X60,Data!$W$2:$BG$33,25,FALSE)","v":0},{"$f":"VLOOKUP(X60,Data!$W$2:$BG$33,31,FALSE)","v":0},{"$f":"VLOOKUP(X60,Data!$W$2:$BG$33,37,FALSE)","v":0},null,null,null,"4+",{"$f":"VLOOKUP(X61,Data!$W$2:$BG$33,7,FALSE)","v":0},{"$f":"VLOOKUP(X61,Data!$W$2:$BG$33,13,FALSE)","v":0},{"$f":"VLOOKUP(X61,Data!$W$2:$BG$33,19,FALSE)","v":0},{"$f":"VLOOKUP(X61,Data!$W$2:$BG$33,25,FALSE)","v":0},{"$f":"VLOOKUP(X61,Data!$W$2:$BG$33,31,FALSE)","v":0},{"$f":"VLOOKUP(X61,Data!$W$2:$BG$33,37,FALSE)","v":0},null,null,null,"4+",{"$f":"VLOOKUP(AR60,Data!$W$2:$BG$33,7,FALSE)","v":1},{"$f":"VLOOKUP(AR60,Data!$W$2:$BG$33,13,FALSE)","v":0},{"$f":"VLOOKUP(AR60,Data!$W$2:$BG$33,19,FALSE)","v":0},{"$f":"VLOOKUP(AR60,Data!$W$2:$BG$33,25,FALSE)","v":0},{"$f":"VLOOKUP(AR60,Data!$W$2:$BG$33,31,FALSE)","v":0},{"$f":"VLOOKUP(AR60,Data!$W$2:$BG$33,37,FALSE)","v":0},null,null,null,"4+",{"$f":"VLOOKUP(AR61,Data!$W$2:$BG$33,7,FALSE)","v":0},{"$f":"VLOOKUP(AR61,Data!$W$2:$BG$33,13,FALSE)","v":0},{"$f":"VLOOKUP(AR61,Data!$W$2:$BG$33,19,FALSE)","v":0},{"$f":"VLOOKUP(AR61,Data!$W$2:$BG$33,25,FALSE)","v":0},{"$f":"VLOOKUP(AR61,Data!$W$2:$BG$33,31,FALSE)","v":0},{"$f":"VLOOKUP(AR61,Data!$W$2:$BG$33,37,FALSE)","v":0},null,null,{"$f":"SUM(E64:BI70)-120","v":6571}]
[]
[null,null,null,null,{"$f":"VLOOKUP(D76,Data!$B$2:$J$33,4,FALSE)","v":"[1/4] 1er Poule A vs. 2eme Poule B"},null,null,null,null,null,null,null,null,null,{"$f":"VLOOKUP(D77,Data!$B$2:$J$33,4,FALSE)","v":"[1/4] 1er Poule C vs. 2eme Poule D"},null,null,null,null,null,null,null,null,null,{"$f":"VLOOKUP(X76,Data!$B$2:$J$33,4,FALSE)","v":"[1/4] 1er Poule B vs. 2eme Poule A"},null,null,null,null,null,null,null,null,null,{"$f":"VLOOKUP(X77,Data!$B$2:$J$33,4,FALSE)","v":"[1/4] 1er Poule D vs. 2eme Poule C"}]
[]
[null,null,null,null,{"$f":"VLOOKUP(D76,Data!$B$2:$J$33,7,FALSE)","v":"2012-06-21T20:45:00"},null,null,null,null,null,null,null,null,null,{"$f":"VLOOKUP(D77,Data!$B$2:$J$33,7,FALSE)","v":"2012-06-22T20:45:00"},null,null,null,null,null,null,null,null,null,{"$f":"VLOOKUP(X76,Data!$B$2:$J$33,7,FALSE)","v":"2012-06-23T20:45:00"},null,null,null,null,null,null,null,null,null,{"$f":"VLOOKUP(X77,Data!$B$2:$J$33,7,FALSE)","v":"2012-06-24T20:45:00"}]
[]
[null,null,null,25,{"$f":"IF(ISBLANK(VLOOKUP(D76,Data!$B$2:$J$33,5,FALSE)),\"\",VLOOKUP(D76,Data!$B$2:$J$33,5,FALSE))","v":"Rép.Tchèque"},null,null,"vs",{"$f":"IF(ISBLANK(VLOOKUP(D76,Data!$B$2:$J$33,6,FALSE)),\"\",VLOOKUP(D76,Data!$B$2:$J$33,6,FALSE))","v":"Portugal"},null,null,null,null,null,{"$f":"IF(ISBLANK(VLOOKUP(D77,Data!$B$2:$J$33,5,FALSE)),\"\",VLOOKUP(D77,Data!$B$2:$J$33,5,FALSE))","v":"Allemagne"},null,null,"vs",{"$f":"IF(ISBLANK(VLOOKUP(D77,Data!$B$2:$J$33,6,FALSE)),\"\",VLOOKUP(D77,Data!$B$2:$J$33,6,FALSE))","v":"Grèce"},null,null,null,null,27,{"$f":"IF(ISBLANK(VLOOKUP(X77,Data!$B$2:$J$33,5,FALSE)),\"\",VLOOKUP(X76,Data!$B$2:$J$33,5,FALSE))","v":"Espagne"},null,null,"vs",{"$f":"IF(ISBLANK(VLOOKUP(X76,Data!$B$2:$J$33,6,FALSE)),\"\",VLOOKUP(X76,Data!$B$2:$J$33,6,FALSE))","v":"Angleterre"},null,null,null,null,null,{"$f":"IF(ISBLANK(VLOOKUP(X77,Data!$B$2:$J$33,5,FALSE)),\"\",VLOOKUP(X77,Data!$B$2:$J$33,5,FALSE))","v":"France"},null,null,"vs",{"$f":"IF(ISBLANK(VLOOKUP(X77,Data!$B$2:$J$33,6,FALSE)),\"\",VLOOKUP(X77,Data!$B$2:$J$33,6,FALSE))","v":"Italie"}]
[null,null,null,26,{"$f":"VLOOKUP(D76,Data!$B$2:$J$33,2,FALSE)","v":""},null,null,{"$f":"H13","v":"à"},{"$f":"VLOOKUP(D76,Data!$B$2:$J$33,3,FALSE)","v":""},null,null,null,null,null,{"$f":"VLOOKUP(D77,Data!$B$2:$J$33,2,FALSE)","v":""},null,null,{"$f":"H13","v":"à"},{"$f":"VLOOKUP(D77,Data!$B$2:$J$33,3,FALSE)","v":""},null,null,null,null,28,{"$f":"VLOOKUP(X76,Data!$B$2:$J$33,2,FALSE)","v":""},null,null,{"$f":"H13","v":"à"},{"$f":"VLOOKUP(X76,Data!$B$2:$J$33,3,FALSE)","v":""},null,null,null,null,null,{"$f":"VLOOKUP(X77,Data!$B$2:$J$33,2,FALSE)","v":""},null,null,{"$f":"H13","v":"à"},{"$f":"VLOOKUP(X77,Data!$B$2:$J$33,3,FALSE)","v":""}]
[null,null,null,null,{"$f":"ROUND((SUM(G81:G86)*G80+SUM(H81:H86)*H80+SUM(I81:I86)*I80+SUM(J81:J86)*J80+SUM(K81:K86)*5)/IF(SUM(F81:K86)=0,1,SUM(F81:K86)),2)","v":0.85},null,null,null,{"$f":"ROUND((SUM(F82:K82)*E82+SUM(F83:K83)*E83+SUM(F84:K84)*E84+SUM(F85:K85)*E85++SUM(F86:K86)*5)/IF(SUM(F81:K86)=0,1,SUM(F81:K86)),2)","v":1.98},null,null,null,null,null,{"$f":"ROUND((SUM(Q81:Q86)*Q80+SUM(R81:R86)*R80+SUM(S81:S86)*S80+SUM(T81:T86)*T80+SUM(U81:U86)*5)/IF(SUM(P81:U86)=0,1,SUM(P81:U86)),2)","v":2.4},null,null,null,{"$f":"ROUND((SUM(P82:U82)*O82+SUM(P83:U83)*O83+SUM(P84:U84)*O84+SUM(P85:U85)*O85++SUM(P86:U86)*5)/IF(SUM(P81:U86)=0,1,SUM(P81:U86)),2)","v":0.5},null,null,null,null,null,{"$f":"ROUND((SUM(AA81:AA86)*AA80+SUM(AB81:AB86)*AB80+SUM(AC81:AC86)*AC80+SUM(AD81:AD86)*AD80+SUM(AE81:AE86)*5)/IF(SUM(Z81:AE86)=0,1,SUM(Z81:AE86)),2)","v":2.0299999999999998},null,null,null,{"$f":"ROUND((SUM(Z82:AE82)*Y82+SUM(Z83:AE83)*Y83+SUM(Z84:AE84)*Y84+SUM(Z85:AE85)*Y85++SUM(Z86:AE86)*5)/IF(SUM(Z81:AE86)=0,1,SUM(Z81:AE86)),2)","v":0.83},null,null,null,null,null,{"$f":"ROUND((SUM(AK81:AK86)*AK80+SUM(AL81:AL86)*AL80+SUM(AM81:AM86)*AM80+SUM(AN81:AN86)*AN80+SUM(AO81:AO86)*5)/IF(SUM(AJ81:AO86)=0,1,SUM(AJ81:AO86)),2)","v":1.5},null,null,null,{"$f":"ROUND((SUM(AJ82:AO82)*AI82+SUM(AJ83:AO83)*AI83+SUM(AJ84:AO84)*AI84+SUM(AJ85:AO85)*AI85++SUM(AJ86:AO86)*5)/IF(SUM(AJ81:AO86)=0,1,SUM(AJ81:AO86)),2)","v":0.81}]
[null,null,null,null,{"$f":"E76","v":"Rép.Tchèque"},null,null,null,null,null,null,null,null,null,{"$f":"O76","v":"Allemagne"},null,null,null,null,null,null,null,null,null,{"$f":"Y76","v":"Espagne"},null,null,null,null,null,null,null,null,null,{"$f":"AI76","v":"France"}]
[null,null,{"$f":"I76","v":"Portugal"},null,null,0,1,2,3,4,"4+",null,null,{"$f":"S76","v":"Grèce"},null,0,1,2,3,4,"4+",null,{"$f":"AC76","v":"Angleterre"},null,null,0,1,2,3,4,"4+",null,null,{"$f":"AM76","v":"Italie"},null,0,1,2,3,4,"4+"]
[null,null,null,null,0,{"$f":"VLOOKUP(D76,Data!$W$2:$BG$33,2,FALSE)","v":6},{"$f":"VLOOKUP(D76,Data!$W$2:$BG$33,8,FALSE)","v":19},{"$f":"VLOOKUP(D76,Data!$W$2:$BG$33,14,FALSE)","v":14},{"$f":"VLOOKUP(D76,Data!$W$2:$BG$33,20,FALSE)","v":0},{"$f":"VLOOKUP(D76,Data!$W$2:$BG$33,26,FALSE)","v":0},{"$f":"VLOOKUP(D76,Data!$W$2:$BG$33,32,FALSE)","v":0},null,null,null,0,{"$f":"VLOOKUP(D77,Data!$W$2:$BG$33,2,FALSE)","v":2},{"$f":"VLOOKUP(D77,Data!$W$2:$BG$33,8,FALSE)","v":54},{"$f":"VLOOKUP(D77,Data!$W$2:$BG$33,14,FALSE)","v":269},{"$f":"VLOOKUP(D77,Data!$W$2:$BG$33,20,FALSE)","v":131},{"$f":"VLOOKUP(D77,Data!$W$2:$BG$33,26,FALSE)","v":22},{"$f":"VLOOKUP(D77,Data!$W$2:$BG$33,32,FALSE)","v":4},null,null,null,0,{"$f":"VLOOKUP(X76,Data!$W$2:$BG$33,2,FALSE)","v":19},{"$f":"VLOOKUP(X76,Data!$W$2:$BG$33,8,FALSE)","v":85},{"$f":"VLOOKUP(X76,Data!$W$2:$BG$33,14,FALSE)","v":145},{"$f":"VLOOKUP(X76,Data!$W$2:$BG$33,20,FALSE)","v":39},{"$f":"VLOOKUP(X76,Data!$W$2:$BG$33,26,FALSE)","v":6},{"$f":"VLOOKUP(X76,Data!$W$2:$BG$33,32,FALSE)","v":0},null,null,null,0,{"$f":"VLOOKUP(X77,Data!$W$2:$BG$33,2,FALSE)","v":32},{"$f":"VLOOKUP(X77,Data!$W$2:$BG$33,8,FALSE)","v":174},{"$f":"VLOOKUP(X77,Data!$W$2:$BG$33,14,FALSE)","v":93},{"$f":"VLOOKUP(X77,Data!$W$2:$BG$33,20,FALSE)","v":7},{"$f":"VLOOKUP(X77,Data!$W$2:$BG$33,26,FALSE)","v":1},{"$f":"VLOOKUP(X77,Data!$W$2:$BG$33,32,FALSE)","v":2}]
[null,null,null,null,1,{"$f":"VLOOKUP(D76,Data!$W$2:$BG$33,3,FALSE)","v":77},{"$f":"VLOOKUP(D76,Data!$W$2:$BG$33,9,FALSE)","v":33},{"$f":"VLOOKUP(D76,Data!$W$2:$BG$33,15,FALSE)","v":41},{"$f":"VLOOKUP(D76,Data!$W$2:$BG$33,21,FALSE)","v":3},{"$f":"VLOOKUP(D76,Data!$W$2:$BG$33,27,FALSE)","v":1},{"$f":"VLOOKUP(D76,Data!$W$2:$BG$33,33,FALSE)","v":0},null,null,null,1,{"$f":"VLOOKUP(D77,Data!$W$2:$BG$33,3,FALSE)","v":4},{"$f":"VLOOKUP(D77,Data!$W$2:$BG$33,9,FALSE)","v":12},{"$f":"VLOOKUP(D77,Data!$W$2:$BG$33,15,FALSE)","v":120},{"$f":"VLOOKUP(D77,Data!$W$2:$BG$33,21,FALSE)","v":178},{"$f":"VLOOKUP(D77,Data!$W$2:$BG$33,27,FALSE)","v":18},{"$f":"VLOOKUP(D77,Data!$W$2:$BG$33,33,FALSE)","v":1},null,null,null,1,{"$f":"VLOOKUP(X76,Data!$W$2:$BG$33,3,FALSE)","v":17},{"$f":"VLOOKUP(X76,Data!$W$2:$BG$33,9,FALSE)","v":57},{"$f":"VLOOKUP(X76,Data!$W$2:$BG$33,15,FALSE)","v":218},{"$f":"VLOOKUP(X76,Data!$W$2:$BG$33,21,FALSE)","v":146},{"$f":"VLOOKUP(X76,Data!$W$2:$BG$33,27,FALSE)","v":10},{"$f":"VLOOKUP(X76,Data!$W$2:$BG$33,33,FALSE)","v":0},null,null,null,1,{"$f":"VLOOKUP(X77,Data!$W$2:$BG$33,3,FALSE)","v":38},{"$f":"VLOOKUP(X77,Data!$W$2:$BG$33,9,FALSE)","v":118},{"$f":"VLOOKUP(X77,Data!$W$2:$BG$33,15,FALSE)","v":229},{"$f":"VLOOKUP(X77,Data!$W$2:$BG$33,21,FALSE)","v":39},{"$f":"VLOOKUP(X77,Data!$W$2:$BG$33,27,FALSE)","v":2},{"$f":"VLOOKUP(X77,Data!$W$2:$BG$33,33,FALSE)","v":0}]
[null,null,null,null,2,{"$f":"VLOOKUP(D76,Data!$W$2:$BG$33,4,FALSE)","v":164},{"$f":"VLOOKUP(D76,Data!$W$2:$BG$33,10,FALSE)","v":266},{"$f":"VLOOKUP(D76,Data!$W$2:$BG$33,16,FALSE)","v":33},{"$f":"VLOOKUP(D76,Data!$W$2:$BG$33,22,FALSE)","v":7},{"$f":"VLOOKUP(D76,Data!$W$2:$BG$33,28,FALSE)","v":0},{"$f":"VLOOKUP(D76,Data!$W$2:$BG$33,34,FALSE)","v":0},null,null,null,2,{"$f":"VLOOKUP(D77,Data!$W$2:$BG$33,4,FALSE)","v":0},{"$f":"VLOOKUP(D77,Data!$W$2:$BG$33,10,FALSE)","v":7},{"$f":"VLOOKUP(D77,Data!$W$2:$BG$33,16,FALSE)","v":9},{"$f":"VLOOKUP(D77,Data!$W$2:$BG$33,22,FALSE)","v":24},{"$f":"VLOOKUP(D77,Data!$W$2:$BG$33,28,FALSE)","v":4},{"$f":"VLOOKUP(D77,Data!$W$2:$BG$33,34,FALSE)","v":0},null,null,null,2,{"$f":"VLOOKUP(X76,Data!$W$2:$BG$33,4,FALSE)","v":2},{"$f":"VLOOKUP(X76,Data!$W$2:$BG$33,10,FALSE)","v":32},{"$f":"VLOOKUP(X76,Data!$W$2:$BG$33,16,FALSE)","v":24},{"$f":"VLOOKUP(X76,Data!$W$2:$BG$33,22,FALSE)","v":32},{"$f":"VLOOKUP(X76,Data!$W$2:$BG$33,28,FALSE)","v":7},{"$f":"VLOOKUP(X76,Data!$W$2:$BG$33,34,FALSE)","v":3},null,null,null,2,{"$f":"VLOOKUP(X77,Data!$W$2:$BG$33,4,FALSE)","v":14},{"$f":"VLOOKUP(X77,Data!$W$2:$BG$33,10,FALSE)","v":51},{"$f":"VLOOKUP(X77,Data!$W$2:$BG$33,16,FALSE)","v":30},{"$f":"VLOOKUP(X77,Data!$W$2:$BG$33,22,FALSE)","v":16},{"$f":"VLOOKUP(X77,Data!$W$2:$BG$33,28,FALSE)","v":1},{"$f":"VLOOKUP(X77,Data!$W$2:$BG$33,34,FALSE)","v":1}]
[null,null,null,null,3,{"$f":"VLOOKUP(D76,Data!$W$2:$BG$33,5,FALSE)","v":28},{"$f":"VLOOKUP(D76,Data!$W$2:$BG$33,11,FALSE)","v":124},{"$f":"VLOOKUP(D76,Data!$W$2:$BG$33,17,FALSE)","v":31},{"$f":"VLOOKUP(D76,Data!$W$2:$BG$33,23,FALSE)","v":0},{"$f":"VLOOKUP(D76,Data!$W$2:$BG$33,29,FALSE)","v":0},{"$f":"VLOOKUP(D76,Data!$W$2:$BG$33,35,FALSE)","v":0},null,null,null,3,{"$f":"VLOOKUP(D77,Data!$W$2:$BG$33,5,FALSE)","v":1},{"$f":"VLOOKUP(D77,Data!$W$2:$BG$33,11,FALSE)","v":1},{"$f":"VLOOKUP(D77,Data!$W$2:$BG$33,17,FALSE)","v":0},{"$f":"VLOOKUP(D77,Data!$W$2:$BG$33,23,FALSE)","v":1},{"$f":"VLOOKUP(D77,Data!$W$2:$BG$33,29,FALSE)","v":0},{"$f":"VLOOKUP(D77,Data!$W$2:$BG$33,35,FALSE)","v":0},null,null,null,3,{"$f":"VLOOKUP(X76,Data!$W$2:$BG$33,5,FALSE)","v":1},{"$f":"VLOOKUP(X76,Data!$W$2:$BG$33,11,FALSE)","v":3},{"$f":"VLOOKUP(X76,Data!$W$2:$BG$33,17,FALSE)","v":11},{"$f":"VLOOKUP(X76,Data!$W$2:$BG$33,23,FALSE)","v":1},{"$f":"VLOOKUP(X76,Data!$W$2:$BG$33,29,FALSE)","v":0},{"$f":"VLOOKUP(X76,Data!$W$2:$BG$33,35,FALSE)","v":0},null,null,null,3,{"$f":"VLOOKUP(X77,Data!$W$2:$BG$33,5,FALSE)","v":0},{"$f":"VLOOKUP(X77,Data!$W$2:$BG$33,11,FALSE)","v":7},{"$f":"VLOOKUP(X77,Data!$W$2:$BG$33,17,FALSE)","v":3},{"$f":"VLOOKUP(X77,Data!$W$2:$BG$33,23,FALSE)","v":1},{"$f":"VLOOKUP(X77,Data!$W$2:$BG$33,29,FALSE)","v":2},{"$f":"VLOOKUP(X77,Data!$W$2:$BG$33,35,FALSE)","v":0}]
[null,null,null,null,4,{"$f":"VLOOKUP(D76,Data!$W$2:$BG$33,6,FALSE)","v":1},{"$f":"VLOOKUP(D76,Data!$W$2:$BG$33,12,FALSE)","v":9},{"$f":"VLOOKUP(D76,Data!$W$2:$BG$33,18,FALSE)","v":5},{"$f":"VLOOKUP(D76,Data!$W$2:$BG$33,24,FALSE)","v":0},{"$f":"VLOOKUP(D76,Data!$W$2:$BG$33,30,FALSE)","v":0},{"$f":"VLOOKUP(D76,Data!$W$2:$BG$33,36,FALSE)","v":0},null,null,null,4,{"$f":"VLOOKUP(D77,Data!$W$2:$BG$33,6,FALSE)","v":0},{"$f":"VLOOKUP(D77,Data!$W$2:$BG$33,12,FALSE)","v":0},{"$f":"VLOOKUP(D77,Data!$W$2:$BG$33,18,FALSE)","v":0},{"$f":"VLOOKUP(D77,Data!$W$2:$BG$33,24,FALSE)","v":0},{"$f":"VLOOKUP(D77,Data!$W$2:$BG$33,30,FALSE)","v":0},{"$f":"VLOOKUP(D77,Data!$W$2:$BG$33,36,FALSE)","v":0},null,null,null,4,{"$f":"VLOOKUP(X76,Data!$W$2:$BG$33,6,FALSE)","v":1},{"$f":"VLOOKUP(X76,Data!$W$2:$BG$33,12,FALSE)","v":0},{"$f":"VLOOKUP(X76,Data!$W$2:$BG$33,18,FALSE)","v":0},{"$f":"VLOOKUP(X76,Data!$W$2:$BG$33,24,FALSE)","v":0},{"$f":"VLOOKUP(X76,Data!$W$2:$BG$33,30,FALSE)","v":1},{"$f":"VLOOKUP(X76,Data!$W$2:$BG$33,36,FALSE)","v":1},null,null,null,4,{"$f":"VLOOKUP(X77,Data!$W$2:$BG$33,6,FALSE)","v":1},{"$f":"VLOOKUP(X77,Data!$W$2:$BG$33,12,FALSE)","v":0},{"$f":"VLOOKUP(X77,Data!$W$2:$BG$33,18,FALSE)","v":0},{"$f":"VLOOKUP(X77,Data!$W$2:$BG$33,24,FALSE)","v":0},{"$f":"VLOOKUP(X77,Data!$W$2:$BG$33,30,FALSE)","v":1},{"$f":"VLOOKUP(X77,Data!$W$2:$BG$33,36,FALSE)","v":0}]
[null,null,null,null,"4+",{"$f":"VLOOKUP(D76,Data!$W$2:$BG$33,7,FALSE)","v":0},{"$f":"VLOOKUP(D76,Data!$W$2:$BG$33,13,FALSE)","v":2},{"$f":"VLOOKUP(D76,Data!$W$2:$BG$33,19,FALSE)","v":0},{"$f":"VLOOKUP(D76,Data!$W$2:$BG$33,25,FALSE)","v":0},{"$f":"VLOOKUP(D76,Data!$W$2:$BG$33,31,FALSE)","v":0},{"$f":"VLOOKUP(D76,Data!$W$2:$BG$33,37,FALSE)","v":0},null,null,null,"4+",{"$f":"VLOOKUP(D77,Data!$W$2:$BG$33,7,FALSE)","v":0},{"$f":"VLOOKUP(D77,Data!$W$2:$BG$33,13,FALSE)","v":0},{"$f":"VLOOKUP(D77,Data!$W$2:$BG$33,19,FALSE)","v":0},{"$f":"VLOOKUP(D77,Data!$W$2:$BG$33,25,FALSE)","v":0},{"$f":"VLOOKUP(D77,Data!$W$2:$BG$33,31,FALSE)","v":0},{"$f":"VLOOKUP(D77,Data!$W$2:$BG$33,37,FALSE)","v":0},null,null,null,"4+",{"$f":"VLOOKUP(X76,Data!$W$2:$BG$33,7,FALSE)","v":0},{"$f":"VLOOKUP(X76,Data!$W$2:$BG$33,13,FALSE)","v":0},{"$f":"VLOOKUP(X76,Data!$W$2:$BG$33,19,FALSE)","v":0},{"$f":"VLOOKUP(X76,Data!$W$2:$BG$33,25,FALSE)","v":1},{"$f":"VLOOKUP(X76,Data!$W$2:$BG$33,31,FALSE)","v":0},{"$f":"VLOOKUP(X76,Data!$W$2:$BG$33,37,FALSE)","v":0},null,null,null,"4+",{"$f":"VLOOKUP(X77,Data!$W$2:$BG$33,7,FALSE)","v":0},{"$f":"VLOOKUP(X77,Data!$W$2:$BG$33,13,FALSE)","v":0},{"$f":"VLOOKUP(X77,Data!$W$2:$BG$33,19,FALSE)","v":0},{"$f":"VLOOKUP(X77,Data!$W$2:$BG$33,25,FALSE)","v":0},{"$f":"VLOOKUP(X77,Data!$W$2:$BG$33,31,FALSE)","v":0},{"$f":"VLOOKUP(X77,Data!$W$2:$BG$33,37,FALSE)","v":0}]
[null,null,null,null,null,null,null,null,null,null,null,null,null,null,null,null,null,null,null,null,null,null,null,null,null,null,null,null,null,null,null,null,null,null,null,null,null,null,null,null,null,null,null,null,null,null,null,null,null,null,null,null,null,null,null,null,null,null,null,null,null,null,null,{"$f":"SUM(E80:BI86)-80","v":3451}]
[null,null,null,null,{"$f":"VLOOKUP(D92,Data!$B$2:$J$33,4,FALSE)","v":"[1/2] 1er Quarts 1 vs. 1er Quarts 2"},null,null,null,null,null,null,null,null,null,{"$f":"VLOOKUP(D93,Data!$B$2:$J$33,4,FALSE)","v":"[1/2] 1er Quarts 3 vs. 1er Quarts 4"}]
[]
[null,null,null,null,{"$f":"VLOOKUP(D92,Data!$B$2:$J$33,7,FALSE)","v":"2012-06-27T20:45:00"},null,null,null,null,null,null,null,null,null,{"$f":"VLOOKUP(D93,Data!$B$2:$J$33,7,FALSE)","v":"2012-06-28T20:45:00"}]
[]
[null,null,null,29,{"$f":"IF(ISBLANK(VLOOKUP(D92,Data!$B$2:$J$33,5,FALSE)),\"\",VLOOKUP(D92,Data!$B$2:$J$33,5,FALSE))","v":"-"},null,null,"vs",{"$f":"IF(ISBLANK(VLOOKUP(D92,Data!$B$2:$J$33,6,FALSE)),\"\",VLOOKUP(D92,Data!$B$2:$J$33,6,FALSE))","v":"-"},null,null,null,null,null,{"$f":"IF(ISBLANK(VLOOKUP(D93,Data!$B$2:$J$33,5,FALSE)),\"\",VLOOKUP(D93,Data!$B$2:$J$33,5,FALSE))","v":"-"},null,null,"vs",{"$f":"IF(ISBLANK(VLOOKUP(D93,Data!$B$2:$J$33,6,FALSE)),\"\",VLOOKUP(D93,Data!$B$2:$J$33,6,FALSE))","v":"-"}]
[null,null,null,30,{"$f":"VLOOKUP(D92,Data!$B$2:$J$33,2,FALSE)","v":""},null,null,{"$f":"H13","v":"à"},{"$f":"VLOOKUP(D92,Data!$B$2:$J$33,3,FALSE)","v":""},null,null,null,null,null,{"$f":"VLOOKUP(D93,Data!$B$2:$J$33,2,FALSE)","v":""},null,null,{"$f":"H13","v":"à"},{"$f":"VLOOKUP(D93,Data!$B$2:$J$33,3,FALSE)","v":""}]
[null,null,null,null,{"$f":"ROUND((SUM(G97:G102)*G96+SUM(H97:H102)*H96+SUM(I97:I102)*I96+SUM(J97:J102)*J96+SUM(K97:K102)*5)/IF(SUM(F97:K102)=0,1,SUM(F97:K102)),2)","v":1.22},null,null,null,{"$f":"ROUND((SUM(F98:K98)*E98+SUM(F99:K99)*E99+SUM(F100:K100)*E100+SUM(F101:K101)*E101++SUM(F102:K102)*5)/IF(SUM(F97:K102)=0,1,SUM(F97:K102)),2)","v":1.69},null,null,null,null,null,{"$f":"ROUND((SUM(Q97:Q102)*Q96+SUM(R97:R102)*R96+SUM(S97:S102)*S96+SUM(T97:T102)*T96+SUM(U97:U102)*5)/IF(SUM(P97:U102)=0,1,SUM(P97:U102)),2)","v":1.5},null,null,null,{"$f":"ROUND((SUM(P98:U98)*O98+SUM(P99:U99)*O99+SUM(P100:U100)*O100+SUM(P101:U101)*O101++SUM(P102:U102)*5)/IF(SUM(P97:U102)=0,1,SUM(P97:U102)),2)","v":1.17}]
[null,null,null,null,{"$f":"E92","v":"-"},null,null,null,null,null,null,null,null,null,{"$f":"O92","v":"-"}]
[null,null,{"$f":"I92","v":"-"},null,null,0,1,2,3,4,"4+",null,null,{"$f":"S92","v":"-"},null,0,1,2,3,4,"4+"]
[null,null,null,null,0,{"$f":"VLOOKUP(D92,Data!$W$2:$BG$33,2,FALSE)","v":15},{"$f":"VLOOKUP(D92,Data!$W$2:$BG$33,8,FALSE)","v":36},{"$f":"VLOOKUP(D92,Data!$W$2:$BG$33,14,FALSE)","v":22},{"$f":"VLOOKUP(D92,Data!$W$2:$BG$33,20,FALSE)","v":2},{"$f":"VLOOKUP(D92,Data!$W$2:$BG$33,26,FALSE)","v":0},{"$f":"VLOOKUP(D92,Data!$W$2:$BG$33,32,FALSE)","v":0},null,null,null,0,{"$f":"VLOOKUP(D93,Data!$W$2:$BG$33,2,FALSE)","v":16},{"$f":"VLOOKUP(D93,Data!$W$2:$BG$33,8,FALSE)","v":92},{"$f":"VLOOKUP(D93,Data!$W$2:$BG$33,14,FALSE)","v":81},{"$f":"VLOOKUP(D93,Data!$W$2:$BG$33,20,FALSE)","v":16},{"$f":"VLOOKUP(D93,Data!$W$2:$BG$33,26,FALSE)","v":0},{"$f":"VLOOKUP(D93,Data!$W$2:$BG$33,32,FALSE)","v":0}]
[null,null,null,null,1,{"$f":"VLOOKUP(D92,Data!$W$2:$BG$33,3,FALSE)","v":89},{"$f":"VLOOKUP(D92,Data!$W$2:$BG$33,9,FALSE)","v":70},{"$f":"VLOOKUP(D92,Data!$W$2:$BG$33,15,FALSE)","v":104},{"$f":"VLOOKUP(D92,Data!$W$2:$BG$33,21,FALSE)","v":8},{"$f":"VLOOKUP(D92,Data!$W$2:$BG$33,27,FALSE)","v":0},{"$f":"VLOOKUP(D92,Data!$W$2:$BG$33,33,FALSE)","v":0},null,null,null,1,{"$f":"VLOOKUP(D93,Data!$W$2:$BG$33,3,FALSE)","v":79},{"$f":"VLOOKUP(D93,Data!$W$2:$BG$33,9,FALSE)","v":66},{"$f":"VLOOKUP(D93,Data!$W$2:$BG$33,15,FALSE)","v":179},{"$f":"VLOOKUP(D93,Data!$W$2:$BG$33,21,FALSE)","v":43},{"$f":"VLOOKUP(D93,Data!$W$2:$BG$33,27,FALSE)","v":2},{"$f":"VLOOKUP(D93,Data!$W$2:$BG$33,33,FALSE)","v":0}]
[null,null,null,null,2,{"$f":"VLOOKUP(D92,Data!$W$2:$BG$33,4,FALSE)","v":59},{"$f":"VLOOKUP(D92,Data!$W$2:$BG$33,10,FALSE)","v":207},{"$f":"VLOOKUP(D92,Data!$W$2:$BG$33,16,FALSE)","v":74},{"$f":"VLOOKUP(D92,Data!$W$2:$BG$33,22,FALSE)","v":17},{"$f":"VLOOKUP(D92,Data!$W$2:$BG$33,28,FALSE)","v":1},{"$f":"VLOOKUP(D92,Data!$W$2:$BG$33,34,FALSE)","v":0},null,null,null,2,{"$f":"VLOOKUP(D93,Data!$W$2:$BG$33,4,FALSE)","v":17},{"$f":"VLOOKUP(D93,Data!$W$2:$BG$33,10,FALSE)","v":110},{"$f":"VLOOKUP(D93,Data!$W$2:$BG$33,16,FALSE)","v":44},{"$f":"VLOOKUP(D93,Data!$W$2:$BG$33,22,FALSE)","v":26},{"$f":"VLOOKUP(D93,Data!$W$2:$BG$33,28,FALSE)","v":1},{"$f":"VLOOKUP(D93,Data!$W$2:$BG$33,34,FALSE)","v":0}]
[null,null,null,null,3,{"$f":"VLOOKUP(D92,Data!$W$2:$BG$33,5,FALSE)","v":4},{"$f":"VLOOKUP(D92,Data!$W$2:$BG$33,11,FALSE)","v":42},{"$f":"VLOOKUP(D92,Data!$W$2:$BG$33,17,FALSE)","v":80},{"$f":"VLOOKUP(D92,Data!$W$2:$BG$33,23,FALSE)","v":2},{"$f":"VLOOKUP(D92,Data!$W$2:$BG$33,29,FALSE)","v":1},{"$f":"VLOOKUP(D92,Data!$W$2:$BG$33,35,FALSE)","v":0},null,null,null,3,{"$f":"VLOOKUP(D93,Data!$W$2:$BG$33,5,FALSE)","v":1},{"$f":"VLOOKUP(D93,Data!$W$2:$BG$33,11,FALSE)","v":22},{"$f":"VLOOKUP(D93,Data!$W$2:$BG$33,17,FALSE)","v":41},{"$f":"VLOOKUP(D93,Data!$W$2:$BG$33,23,FALSE)","v":4},{"$f":"VLOOKUP(D93,Data!$W$2:$BG$33,29,FALSE)","v":1},{"$f":"VLOOKUP(D93,Data!$W$2:$BG$33,35,FALSE)","v":0}]
[null,null,null,null,4,{"$f":"VLOOKUP(D92,Data!$W$2:$BG$33,6,FALSE)","v":4},{"$f":"VLOOKUP(D92,Data!$W$2:$BG$33,12,FALSE)","v":0},{"$f":"VLOOKUP(D92,Data!$W$2:$BG$33,18,FALSE)","v":4},{"$f":"VLOOKUP(D92,Data!$W$2:$BG$33,24,FALSE)","v":3},{"$f":"VLOOKUP(D92,Data!$W$2:$BG$33,30,FALSE)","v":0},{"$f":"VLOOKUP(D92,Data!$W$2:$BG$33,36,FALSE)","v":1},null,null,null,4,{"$f":"VLOOKUP(D93,Data!$W$2:$BG$33,6,FALSE)","v":2},{"$f":"VLOOKUP(D93,Data!$W$2:$BG$33,12,FALSE)","v":0},{"$f":"VLOOKUP(D93,Data!$W$2:$BG$33,18,FALSE)","v":0},{"$f":"VLOOKUP(D93,Data!$W$2:$BG$33,24,FALSE)","v":2},{"$f":"VLOOKUP(D93,Data!$W$2:$BG$33,30,FALSE)","v":0},{"$f":"VLOOKUP(D93,Data!$W$2:$BG$33,36,FALSE)","v":0}]
[null,null,null,null,"4+",{"$f":"VLOOKUP(D92,Data!$W$2:$BG$33,7,FALSE)","v":0},{"$f":"VLOOKUP(D92,Data!$W$2:$BG$33,13,FALSE)","v":0},{"$f":"VLOOKUP(D92,Data!$W$2:$BG$33,19,FALSE)","v":0},{"$f":"VLOOKUP(D92,Data!$W$2:$BG$33,25,FALSE)","v":1},{"$f":"VLOOKUP(D92,Data!$W$2:$BG$33,31,FALSE)","v":0},{"$f":"VLOOKUP(D92,Data!$W$2:$BG$33,37,FALSE)","v":0},null,null,null,"4+",{"$f":"VLOOKUP(D93,Data!$W$2:$BG$33,7,FALSE)","v":0},{"$f":"VLOOKUP(D93,Data!$W$2:$BG$33,13,FALSE)","v":0},{"$f":"VLOOKUP(D93,Data!$W$2:$BG$33,19,FALSE)","v":0},{"$f":"VLOOKUP(D93,Data!$W$2:$BG$33,25,FALSE)","v":0},{"$f":"VLOOKUP(D93,Data!$W$2:$BG$33,31,FALSE)","v":0},{"$f":"VLOOKUP(D93,Data!$W$2:$BG$33,37,FALSE)","v":0},null,null,null,null,null,null,null,null,null,null,null,null,null,null,null,null,null,null,null,null,null,null,null,null,null,null,null,null,null,null,null,null,null,null,null,null,null,null,null,null,null,null,{"$f":"SUM(E96:BI102)-40","v":1691}]
[]
[null,null,null,null,{"$f":"VLOOKUP(D109,Data!$B$2:$J$33,4,FALSE)","v":"Finale"}]
[]
[null,null,null,null,{"$f":"VLOOKUP(D109,Data!$B$2:$J$33,7,FALSE)","v":"2012-07-01T20:45:00"}]
[]
[null,null,null,32,{"$f":"IF(ISBLANK(VLOOKUP(D109,Data!$B$2:$J$33,5,FALSE)),\"\",VLOOKUP(D109,Data!$B$2:$J$33,5,FALSE))","v":"-"},null,null,"vs",{"$f":"IF(ISBLANK(VLOOKUP(D109,Data!$B$2:$J$33,6,FALSE)),\"\",VLOOKUP(D109,Data!$B$2:$J$33,6,FALSE))","v":"-"}]
[null,null,null,32,{"$f":"VLOOKUP(D109,Data!$B$2:$J$33,2,FALSE)","v":""},null,null,{"$f":"H13","v":"à"},{"$f":"VLOOKUP(D109,Data!$B$2:$J$33,3,FALSE)","v":""}]
[null,null,null,null,{"$f":"ROUND((SUM(G113:G118)*G112+SUM(H113:H118)*H112+SUM(I113:I118)*I112+SUM(J113:J118)*J112+SUM(K113:K118)*5)/IF(SUM(F113:K118)=0,1,SUM(F113:K118)),2)","v":1.27},null,null,null,{"$f":"ROUND((SUM(F114:K114)*E114+SUM(F115:K115)*E115+SUM(F116:K116)*E116+SUM(F117:K117)*E117++SUM(F118:K118)*5)/IF(SUM(F113:K118)=0,1,SUM(F113:K118)),2)","v":1.35}]
[null,null,null,null,{"$f":"E108","v":"-"}]
[null,null,null,{"$f":"I108","v":"-"},null,0,1,2,3,4,"4+"]
[null,null,null,null,0,{"$f":"VLOOKUP(D108,Data!$W$2:$BG$33,2,FALSE)","v":13},{"$f":"VLOOKUP(D108,Data!$W$2:$BG$33,8,FALSE)","v":96},{"$f":"VLOOKUP(D108,Data!$W$2:$BG$33,14,FALSE)","v":48},{"$f":"VLOOKUP(D108,Data!$W$2:$BG$33,20,FALSE)","v":7},{"$f":"VLOOKUP(D108,Data!$W$2:$BG$33,26,FALSE)","v":0},{"$f":"VLOOKUP(D108,Data!$W$2:$BG$33,32,FALSE)","v":1}]
[null,null,null,null,1,{"$f":"VLOOKUP(D108,Data!$W$2:$BG$33,3,FALSE)","v":81},{"$f":"VLOOKUP(D108,Data!$W$2:$BG$33,9,FALSE)","v":44},{"$f":"VLOOKUP(D108,Data!$W$2:$BG$33,15,FALSE)","v":146},{"$f":"VLOOKUP(D108,Data!$W$2:$BG$33,21,FALSE)","v":26},{"$f":"VLOOKUP(D108,Data!$W$2:$BG$33,27,FALSE)","v":1},{"$f":"VLOOKUP(D108,Data!$W$2:$BG$33,33,FALSE)","v":0}]
[null,null,null,null,2,{"$f":"VLOOKUP(D108,Data!$W$2:$BG$33,4,FALSE)","v":50},{"$f":"VLOOKUP(D108,Data!$W$2:$BG$33,10,FALSE)","v":185},{"$f":"VLOOKUP(D108,Data!$W$2:$BG$33,16,FALSE)","v":18},{"$f":"VLOOKUP(D108,Data!$W$2:$BG$33,22,FALSE)","v":24},{"$f":"VLOOKUP(D108,Data!$W$2:$BG$33,28,FALSE)","v":1},{"$f":"VLOOKUP(D108,Data!$W$2:$BG$33,34,FALSE)","v":0}]
[null,null,null,null,3,{"$f":"VLOOKUP(D108,Data!$W$2:$BG$33,5,FALSE)","v":13},{"$f":"VLOOKUP(D108,Data!$W$2:$BG$33,11,FALSE)","v":29},{"$f":"VLOOKUP(D108,Data!$W$2:$BG$33,17,FALSE)","v":26},{"$f":"VLOOKUP(D108,Data!$W$2:$BG$33,23,FALSE)","v":3},{"$f":"VLOOKUP(D108,Data!$W$2:$BG$33,29,FALSE)","v":1},{"$f":"VLOOKUP(D108,Data!$W$2:$BG$33,35,FALSE)","v":0}]
[null,null,null,null,4,{"$f":"VLOOKUP(D108,Data!$W$2:$BG$33,6,FALSE)","v":1},{"$f":"VLOOKUP(D108,Data!$W$2:$BG$33,12,FALSE)","v":2},{"$f":"VLOOKUP(D108,Data!$W$2:$BG$33,18,FALSE)","v":2},{"$f":"VLOOKUP(D108,Data!$W$2:$BG$33,24,FALSE)","v":0},{"$f":"VLOOKUP(D108,Data!$W$2:$BG$33,30,FALSE)","v":1},{"$f":"VLOOKUP(D108,Data!$W$2:$BG$33,36,FALSE)","v":0}]
[null,null,null,null,"4+",{"$f":"VLOOKUP(D108,Data!$W$2:$BG$33,7,FALSE)","v":0},{"$f":"VLOOKUP(D108,Data!$W$2:$BG$33,13,FALSE)","v":0},{"$f":"VLOOKUP(D108,Data!$W$2:$BG$33,19,FALSE)","v":1},{"$f":"VLOOKUP(D108,Data!$W$2:$BG$33,25,FALSE)","v":0},{"$f":"VLOOKUP(D108,Data!$W$2:$BG$33,31,FALSE)","v":2},{"$f":"VLOOKUP(D108,Data!$W$2:$BG$33,37,FALSE)","v":0},null,null,null,null,null,null,null,null,null,null,null,null,null,null,null,null,null,null,null,null,null,null,null,null,null,null,null,null,null,null,null,null,null,null,null,null,null,null,null,null,null,null,null,null,null,null,null,null,null,null,null,null,{"$f":"SUM(E112:BI118)-20","v":822}]

{"sheet":"Data","index":3,"n_rows":53,"n_cols":59,"rows_kept":53,"cut":false,"hidden":false,"merged":[]}
["9A99BCB6-BD58-4412-9424-C26C4ADA32D7","GameId","Score Team 1","Score Team 2","GameName","Team1","Team2","GameTime","Penalities Team 1","Penalities Team 2",null,null,"GameId","Score Team 1","Score Team 2","Penalty Team 1","Penalty Team 2",null,"TeamId","Name",null,null,"GameId","0x0","0x1","0x2","0x3","0x4","0x4+","1x0","1x1","1x2","1x3","1x4","1x4+","2x0","2x1","2x2","2x3","2x4","2x4+","3x0","3x1","3x2","3x3","3x4","3x4+","4x0","4x1","4x2","4x3","4x4","4x4+","4+x0","4+x1","4+x2","4+x3","4+x4","4+x4+"]
[null,1,{"$f":"IF(ISBLANK(Scores!E7),\"\",Scores!E7)","v":1},{"$f":"IF(ISBLANK(Scores!F7),\"\",Scores!F7)","v":1},"[Poule A] Equipe 1 vs. Equipe 2",{"$f":"Scores!D7","v":"Pologne"},{"$f":"Scores!G7","v":"Grèce"},"2012-06-08T18:00:00",0,0,null,null,1,1,0,0,0,null,1,"Pologne",null,null,1,47,50,19,1,0,0,331,156,52,3,0,2,140,172,13,3,0,1,11,11,4,1,1,1,1,3,2,0,0,0,3,0,0,0,0,0]
[null,2,{"$f":"IF(ISBLANK(Scores!E8),\"\",Scores!E8)","v":4},{"$f":"IF(ISBLANK(Scores!F8),\"\",Scores!F8)","v":1},"[Poule A] Equipe 3 vs. Equipe 4",{"$f":"Scores!D8","v":"Russie"},{"$f":"Scores!G8","v":"Rép.Tchèque"},"2012-06-08T20:45:00",0,0,null,null,2,1,1,0,0,null,2,"Grèce",null,null,2,22,55,53,4,0,0,130,190,98,9,0,0,96,205,49,8,0,0,10,40,15,3,1,0,0,8,0,0,0,0,1,0,0,0,1,2]
["LCID :",3,{"$f":"IF(ISBLANK(Scores!F10),\"\",Scores!F10)","v":1},{"$f":"IF(ISBLANK(Scores!E10),\"\",Scores!E10)","v":2},"[Poule A] Equipe 2 vs. Equipe 4",{"$f":"Scores!G7","v":"Grèce"},{"$f":"Scores!G8","v":"Rép.Tchèque"},"2012-06-12T18:00:00",0,0,null,null,3,0,2,0,0,null,3,"Russie",null,null,3,90,220,214,30,5,1,74,140,136,55,1,0,22,41,41,6,1,0,6,8,5,0,1,1,2,1,0,1,0,1,0,1,0,0,0,0]
[1036,4,{"$f":"IF(ISBLANK(Scores!E9),\"\",Scores!E9)","v":1},{"$f":"IF(ISBLANK(Scores!F9),\"\",Scores!F9)","v":1},"[Poule A] Equipe 1 vs. Equipe 3",{"$f":"Scores!D7","v":"Pologne"},{"$f":"Scores!D8","v":"Russie"},"2012-06-12T20:45:00",0,0,null,null,4,1,2,0,0,null,4,"Rép.Tchèque",null,null,4,93,139,127,18,1,0,85,282,164,50,1,0,19,59,49,11,0,0,2,9,4,0,0,0,0,1,1,0,1,0,0,0,0,0,0,1]
[null,5,{"$f":"IF(ISBLANK(Scores!E12),\"\",Scores!E12)","v":1},{"$f":"IF(ISBLANK(Scores!F12),\"\",Scores!F12)","v":0},"[Poule A] Equipe 2 vs. Equipe 3",{"$f":"Scores!G7","v":"Grèce"},{"$f":"Scores!D8","v":"Russie"},"2012-06-16T20:45:00",0,0,null,null,5,0,2,0,0,null,5,"Pays-Bas",null,null,5,71,160,233,88,8,2,68,136,159,83,8,0,24,33,29,13,0,1,3,6,2,0,0,0,3,1,1,1,0,0,1,3,0,0,1,2]
[null,6,{"$f":"IF(ISBLANK(Scores!E11),\"\",Scores!E11)","v":1},{"$f":"IF(ISBLANK(Scores!F11),\"\",Scores!F11)","v":0},"[Poule A] Equipe 4 vs. Equipe 1",{"$f":"Scores!G8","v":"Rép.Tchèque"},{"$f":"Scores!D7","v":"Pologne"},"2012-06-16T20:45:00",0,0,null,null,6,1,1,0,0,null,6,"Danemark",null,null,6,95,104,54,2,0,0,134,272,117,22,1,1,63,131,77,10,0,0,18,24,6,1,0,0,1,0,3,0,0,0,0,0,1,0,0,2]
[null,7,{"$f":"IF(ISBLANK(Scores!E15),\"\",Scores!E15)","v":0},{"$f":"IF(ISBLANK(Scores!F15),\"\",Scores!F15)","v":1},"[Poule B] Equipe 1 vs. Equipe 2",{"$f":"Scores!D15","v":"Pays-Bas"},{"$f":"Scores!G15","v":"Danemark"},"2012-06-09T18:00:00",0,0,null,null,7,2,0,0,0,null,7,"Allemagne",null,null,7,10,7,3,1,0,1,61,32,7,0,0,0,308,146,17,4,0,0,126,193,15,1,1,0,19,19,3,0,1,0,3,1,1,0,0,0]
[null,8,{"$f":"IF(ISBLANK(Scores!E16),\"\",Scores!E16)","v":1},{"$f":"IF(ISBLANK(Scores!F16),\"\",Scores!F16)","v":0},"[Poule B] Equipe 3 vs. Equipe 4",{"$f":"Scores!D16","v":"Allemagne"},{"$f":"Scores!G16","v":"Portugal"},"2012-06-09T20:45:00",0,0,null,null,8,0,0,0,0,null,8,"Portugal",null,null,8,18,15,2,0,0,0,83,107,32,7,0,0,107,310,94,9,0,0,17,109,58,7,1,0,3,5,4,0,0,1,0,0,0,0,0,0]
[null,9,{"$f":"IF(ISBLANK(Scores!F18),\"\",Scores!F18)","v":2},{"$f":"IF(ISBLANK(Scores!E18),\"\",Scores!E18)","v":3},"[Poule B] Equipe 2 vs. Equipe 4",{"$f":"Scores!G15","v":"Danemark"},{"$f":"Scores!G16","v":"Portugal"},"2012-06-13T18:00:00",0,0,null,null,9,1,1,0,0,null,9,"Espagne",null,null,9,36,218,230,52,3,4,43,117,226,66,8,1,6,36,38,12,4,0,0,3,1,0,0,0,1,0,0,0,1,1,0,1,0,0,0,0]
[null,10,{"$f":"IF(ISBLANK(Scores!E17),\"\",Scores!E17)","v":1},{"$f":"IF(ISBLANK(Scores!F17),\"\",Scores!F17)","v":2},"[Poule B] Equipe 1 vs. Equipe 3",{"$f":"Scores!D15","v":"Pays-Bas"},{"$f":"Scores!D16","v":"Allemagne"},"2012-06-13T20:45:00",0,0,null,null,10,1,1,0,0,null,10,"Italie",null,null,10,22,67,39,3,2,0,30,235,208,34,1,0,16,76,263,60,5,0,0,11,27,7,1,0,0,0,1,1,1,1,0,1,1,0,0,0]
[null,11,{"$f":"IF(ISBLANK(Scores!E19),\"\",Scores!E19)","v":2},{"$f":"IF(ISBLANK(Scores!F19),\"\",Scores!F19)","v":1},"[Poule B] Equipe 4 vs. Equipe 1",{"$f":"Scores!G16","v":"Portugal"},{"$f":"Scores!D15","v":"Pays-Bas"},"2012-06-17T20:45:00",0,0,null,null,11,0,2,0,0,null,11,"Irlande",null,null,11,36,98,81,14,1,0,46,210,248,91,4,1,21,83,104,42,8,1,1,9,8,5,2,0,1,1,3,0,0,0,0,0,0,0,1,0]
[null,12,{"$f":"IF(ISBLANK(Scores!E20),\"\",Scores!E20)","v":1},{"$f":"IF(ISBLANK(Scores!F20),\"\",Scores!F20)","v":2},"[Poule B] Equipe 2 vs. Equipe 3",{"$f":"Scores!D20","v":"Danemark"},{"$f":"Scores!G20","v":"Allemagne"},"2012-06-17T20:45:00",0,0,null,null,12,0,1,0,0,null,12,"Croatie",null,null,12,17,117,322,176,43,3,8,69,135,138,35,3,6,10,10,13,6,0,0,3,2,0,1,0,0,0,0,1,0,0,0,1,0,0,0,1]
[null,13,{"$f":"IF(ISBLANK(Scores!E23),\"\",Scores!E23)","v":1},{"$f":"IF(ISBLANK(Scores!F23),\"\",Scores!F23)","v":1},"[Poule C] Equipe 1 vs. Equipe 2",{"$f":"Scores!D23","v":"Espagne"},{"$f":"Scores!G23","v":"Italie"},"2012-06-10T18:00:00",0,0,null,null,13,1,1,0,0,null,13,"Ukraine",null,null,13,51,24,1,0,0,0,123,121,23,2,0,0,174,260,42,4,0,0,23,94,33,0,2,0,2,7,2,1,0,1,0,0,0,0,0,0]
[null,14,{"$f":"IF(ISBLANK(Scores!E24),\"\",Scores!E24)","v":1},{"$f":"IF(ISBLANK(Scores!F24),\"\",Scores!F24)","v":3},"[Poule C] Equipe 3 vs. Equipe 4",{"$f":"Scores!D24","v":"Irlande"},{"$f":"Scores!G24","v":"Croatie"},"2012-06-10T20:45:00",0,0,null,null,14,1,1,0,0,null,14,"Suède",null,null,14,93,212,117,12,1,1,90,186,133,32,1,0,21,45,30,5,0,0,2,1,3,1,0,0,1,0,1,0,0,0,0,0,0,1,0,0]
[null,15,{"$f":"IF(ISBLANK(Scores!F26),\"\",Scores!F26)","v":1},{"$f":"IF(ISBLANK(Scores!E26),\"\",Scores!E26)","v":1},"[Poule C] Equipe 2 vs. Equipe 4",{"$f":"Scores!G23","v":"Italie"},{"$f":"Scores!G24","v":"Croatie"},"2012-06-14T18:00:00",0,0,null,null,15,0,1,0,0,null,15,"France",null,null,15,62,47,11,0,0,0,212,262,53,5,0,1,86,235,59,4,2,1,18,31,10,0,0,0,0,3,0,0,0,1,0,0,0,0,0,0]
[null,16,{"$f":"IF(ISBLANK(Scores!E25),\"\",Scores!E25)","v":4},{"$f":"IF(ISBLANK(Scores!F25),\"\",Scores!F25)","v":0},"[Poule C] Equipe 1 vs. Equipe 3",{"$f":"Scores!D23","v":"Espagne"},{"$f":"Scores!D24","v":"Irlande"},"2012-06-14T20:45:00",0,0,null,null,16,1,1,0,0,null,16,"Angleterre",null,null,16,4,3,0,0,0,0,91,17,7,1,0,0,345,80,3,2,0,0,291,126,3,0,0,0,76,45,2,1,0,1,9,1,0,0,0,0]
[null,17,{"$f":"IF(ISBLANK(Scores!E27),\"\",Scores!E27)","v":0},{"$f":"IF(ISBLANK(Scores!F27),\"\",Scores!F27)","v":1},"[Poule C] Equipe 4 vs. Equipe 1",{"$f":"Scores!D27","v":"Croatie"},{"$f":"Scores!G27","v":"Espagne"},"2012-06-18T20:45:00",0,0,null,null,17,0,1,0,0,null,null,null,null,null,17,22,134,239,76,20,2,8,89,286,134,17,1,2,8,28,22,2,0,0,1,2,0,0,0,0,0,0,0,0,0,0,0,0,2,0,0]
[null,18,{"$f":"IF(ISBLANK(Scores!E28),\"\",Scores!E28)","v":2},{"$f":"IF(ISBLANK(Scores!F28),\"\",Scores!F28)","v":0},"[Poule C] Equipe 2 vs. Equipe 3",{"$f":"Scores!D28","v":"Italie"},{"$f":"Scores!G28","v":"Irlande"},"2012-06-18T20:45:00",0,0,null,null,18,1,1,0,0,null,null,null,null,null,18,48,26,1,1,0,0,279,135,18,1,0,0,271,178,35,3,0,0,45,37,13,0,0,0,1,1,0,1,0,0,0,1,1,0,0,0]
[null,19,{"$f":"IF(ISBLANK(Scores!E31),\"\",Scores!E31)","v":1},{"$f":"IF(ISBLANK(Scores!F31),\"\",Scores!F31)","v":1},"[Poule D] Equipe 3 vs. Equipe 4",{"$f":"Scores!D31","v":"France"},{"$f":"Scores!G31","v":"Angleterre"},"2012-06-11T18:00:00",0,0,null,null,19,3,0,0,0,null,null,null,null,null,19,40,28,16,1,0,0,150,187,52,3,2,0,154,315,48,2,2,0,6,37,11,3,1,0,0,2,3,0,0,0,1,0,0,0,0,1]
[null,20,{"$f":"IF(ISBLANK(Scores!E32),\"\",Scores!E32)","v":2},{"$f":"IF(ISBLANK(Scores!F32),\"\",Scores!F32)","v":1},"[Poule D] Equipe 1 vs. Equipe 2",{"$f":"Scores!D32","v":"Ukraine"},{"$f":"Scores!G32","v":"Suède"},"2012-06-11T20:45:00",0,0,null,null,20,1,1,0,0,null,"Success",6,null,null,20,67,152,104,13,1,0,109,284,146,34,2,0,38,74,28,7,0,0,2,5,4,0,0,0,0,1,0,0,0,0,0,0,1,0,0,1]
[null,21,{"$f":"IF(ISBLANK(Scores!F33),\"\",Scores!F33)","v":0},{"$f":"IF(ISBLANK(Scores!E33),\"\",Scores!E33)","v":2},"[Poule D] Equipe 1 vs. Equipe 3",{"$f":"Scores!G33","v":"Ukraine"},{"$f":"Scores!D33","v":"France"},"2012-06-15T18:00:00",0,0,null,null,21,0,1,0,0,null,"Rank",367,null,null,21,31,231,271,60,1,0,9,131,216,104,4,0,5,13,20,14,0,0,1,1,0,0,0,0,0,0,0,0,0,0,0,1,1,1,0,0]
[null,22,{"$f":"IF(ISBLANK(Scores!E34),\"\",Scores!E34)","v":2},{"$f":"IF(ISBLANK(Scores!F34),\"\",Scores!F34)","v":3},"[Poule D] Equipe 2 vs. Equipe 4",{"$f":"Scores!D34","v":"Suède"},{"$f":"Scores!G34","v":"Angleterre"},"2012-06-15T20:45:00",0,0,null,null,22,1,1,0,0,null,"Total",2757,null,null,22,40,168,138,19,0,0,51,216,225,51,1,0,19,73,80,18,4,0,2,2,4,2,0,0,0,1,1,0,0,0,0,0,0,0,1,0]
[null,23,{"$f":"IF(ISBLANK(Scores!E35),\"\",Scores!E35)","v":""},{"$f":"IF(ISBLANK(Scores!F35),\"\",Scores!F35)","v":""},"[Poule D] Equipe 2 vs. Equipe 3",{"$f":"Scores!D35","v":"Suède"},{"$f":"Scores!G35","v":"France"},"2012-06-19T20:45:00",0,0,null,null,23,1,1,0,0,null,null,null,null,null,23,40,176,118,18,1,1,27,262,254,87,3,0,7,20,53,24,3,0,0,3,1,2,0,0,1,1,0,0,0,0,0,0,0,0,0,0]
[null,24,{"$f":"IF(ISBLANK(Scores!E36),\"\",Scores!E36)","v":""},{"$f":"IF(ISBLANK(Scores!F36),\"\",Scores!F36)","v":""},"[Poule D] Equipe 4 vs. Equipe 1",{"$f":"Scores!D36","v":"Angleterre"},{"$f":"Scores!G36","v":"Ukraine"},"2012-06-19T20:45:00",0,0,null,null,24,1,1,0,0,null,null,null,null,null,24,33,24,11,1,0,0,234,121,41,6,0,0,243,183,41,4,0,0,60,76,10,0,0,0,2,5,1,2,0,0,0,2,0,0,0,0]
[null,25,{"$f":"IF(ISBLANK(Scores!V7),\"\",Scores!V7)","v":""},{"$f":"IF(ISBLANK(Scores!V8),\"\",Scores!V8)","v":""},"[1/4] 1er Poule A vs. 2eme Poule B",{"$f":"Scores!U7","v":"Rép.Tchèque"},{"$f":"Scores!U8","v":"Portugal"},"2012-06-21T20:45:00",{"$f":"IF(ISBLANK(Scores!W7),0,Scores!W7)","v":0},{"$f":"IF(ISBLANK(Scores!W8),0,Scores!W8)","v":0},null,null,25,1,2,0,0,null,"Translation",null,null,null,25,6,77,164,28,1,0,19,33,266,124,9,2,14,41,33,31,5,0,0,3,7,0,0,0,0,1,0,0,0,0,0,0,0,0,0,0]
[null,26,{"$f":"IF(ISBLANK(Scores!V9),\"\",Scores!V9)","v":""},{"$f":"IF(ISBLANK(Scores!V10),\"\",Scores!V10)","v":""},"[1/4] 1er Poule C vs. 2eme Poule D",{"$f":"Scores!U9","v":"Allemagne"},{"$f":"Scores!U10","v":"Grèce"},"2012-06-22T20:45:00",{"$f":"IF(ISBLANK(Scores!W9),0,Scores!W9)","v":0},{"$f":"IF(ISBLANK(Scores!W10),0,Scores!W10)","v":0},null,null,26,2,0,0,0,null,1,"TIRAGE AU SORT",null,null,26,2,4,0,1,0,0,54,12,7,1,0,0,269,120,9,0,0,0,131,178,24,1,0,0,22,18,4,0,0,0,4,1,0,0,0,0]
[null,27,{"$f":"IF(ISBLANK(Scores!V11),\"\",Scores!V11)","v":""},{"$f":"IF(ISBLANK(Scores!V12),\"\",Scores!V12)","v":""},"[1/4] 1er Poule B vs. 2eme Poule A",{"$f":"Scores!U11","v":"Espagne"},{"$f":"Scores!U12","v":"Angleterre"},"2012-06-23T20:45:00",{"$f":"IF(ISBLANK(Scores!W11),0,Scores!W11)","v":0},{"$f":"IF(ISBLANK(Scores!W12),0,Scores!W12)","v":0},null,null,27,2,0,0,0,null,2,"Get Rank",null,null,27,19,17,2,1,1,0,85,57,32,3,0,0,145,218,24,11,0,0,39,146,32,1,0,1,6,10,7,0,1,0,0,0,3,0,1,0]
[null,28,{"$f":"IF(ISBLANK(Scores!V13),\"\",Scores!V13)","v":""},{"$f":"IF(ISBLANK(Scores!V14),\"\",Scores!V14)","v":""},"[1/4] 1er Poule D vs. 2eme Poule C",{"$f":"Scores!U13","v":"France"},{"$f":"Scores!U14","v":"Italie"},"2012-06-24T20:45:00",{"$f":"IF(ISBLANK(Scores!W13),0,Scores!W13)","v":0},{"$f":"IF(ISBLANK(Scores!W14),0,Scores!W14)","v":0},null,null,28,2,1,0,0,null,3,"Groupe A",null,null,28,32,38,14,0,1,0,174,118,51,7,0,0,93,229,30,3,0,0,7,39,16,1,0,0,1,2,1,2,1,0,2,0,1,0,0,0]
[null,29,{"$f":"IF(ISBLANK(Scores!V17),\"\",Scores!V17)","v":""},{"$f":"IF(ISBLANK(Scores!V18),\"\",Scores!V18)","v":""},"[1/2] 1er Quarts 1 vs. 1er Quarts 2",{"$f":"Scores!U17","v":"-"},{"$f":"Scores!U18","v":"-"},"2012-06-27T20:45:00",{"$f":"IF(ISBLANK(Scores!W17),0,Scores!W17)","v":0},{"$f":"IF(ISBLANK(Scores!W18),0,Scores!W18)","v":0},null,null,29,2,1,0,0,null,4,"Groupe B",null,null,29,15,89,59,4,4,0,36,70,207,42,0,0,22,104,74,80,4,0,2,8,17,2,3,1,0,0,1,1,0,0,0,0,0,0,1,0]
[null,30,{"$f":"IF(ISBLANK(Scores!V19),\"\",Scores!V19)","v":""},{"$f":"IF(ISBLANK(Scores!V20),\"\",Scores!V20)","v":""},"[1/2] 1er Quarts 3 vs. 1er Quarts 4",{"$f":"Scores!U19","v":"-"},{"$f":"Scores!U20","v":"-"},"2012-06-28T20:45:00",{"$f":"IF(ISBLANK(Scores!W19),0,Scores!W19)","v":0},{"$f":"IF(ISBLANK(Scores!W20),0,Scores!W20)","v":0},null,null,30,2,1,0,0,null,5,"Groupe C",null,null,30,16,79,17,1,2,0,92,66,110,22,0,0,81,179,44,41,0,0,16,43,26,4,2,0,0,2,1,1,0,0,0,0,0,0,0,0]
[null,31,{"$f":"IF(ISBLANK(Scores!AB24),\"\",Scores!AB24)","v":""},{"$f":"IF(ISBLANK(Scores!AB25),\"\",Scores!AB25)","v":""},"Petite Finale",null,null,"2012-06-28T21:00:00",null,null,null,null,32,1,2,0,0,null,6,"Groupe D",null,null,31,0,0,0,0,0,0,0,0,0,0,0,0,0,0,0,0,0,0,0,0,0,0,0,0,0,0,0,0,0,0,0,0,0,0,0,0]
[null,32,{"$f":"IF(ISBLANK(Scores!V24),\"\",Scores!V24)","v":""},{"$f":"IF(ISBLANK(Scores!V25),\"\",Scores!V25)","v":""},"Finale",{"$f":"Scores!U24","v":"-"},{"$f":"Scores!U25","v":"-"},"2012-07-01T20:45:00",{"$f":"IF(ISBLANK(Scores!W24),0,Scores!W24)","v":0},{"$f":"IF(ISBLANK(Scores!W25),0,Scores!W25)","v":0},null,null,null,null,null,null,null,null,7,"Quarts de finale",null,null,32,13,81,50,13,1,0,96,44,185,29,2,0,48,146,18,26,2,1,7,26,24,3,0,0,0,1,1,1,1,2,1,0,0,0,0,0]
[null,null,null,null,null,null,null,null,null,null,null,null,null,null,null,null,null,null,8,"Demi-finales"]
[null,null,null,null,null,null,null,null,null,null,null,null,null,null,null,null,null,null,9,"Finale"]
[null,null,null,null,null,null,null,null,null,null,null,null,null,null,null,null,null,null,10,"Vainqueur"]
[null,null,null,null,null,null,null,null,null,null,null,null,null,null,null,null,null,null,11,"Finaliste"]
[null,null,null,null,null,null,null,null,null,null,null,null,null,null,null,null,null,null,12,"Pts"]
[null,null,null,null,null,null,null,null,null,null,null,null,null,null,null,null,null,null,13,"BP"]
[null,null,null,null,null,null,null,null,null,null,null,null,null,null,null,null,null,null,14,"BC"]
[null,null,null,null,null,null,null,null,null,null,null,null,null,null,null,null,null,null,15,"Statistiques"]
[null,null,null,null,null,null,null,null,null,null,null,null,null,null,null,null,null,null,16,"Succès"]
[null,null,null,null,null,null,null,null,null,null,null,null,null,null,null,null,null,null,17,"Position"]
[null,null,null,null,null,null,null,null,null,null,null,null,null,null,null,null,null,null,18,"Total"]
[null,null,null,null,null,null,null,null,null,null,null,null,null,null,null,null,null,null,19,"Faites vos paris entre amis ! "]
[null,null,null,null,null,null,null,null,null,null,null,null,null,null,null,null,null,null,20,"Inscrivez vos pronostics ou les résultats des matchs dans les tableaux ci-dessous."]
[null,null,null,null,null,null,null,null,null,null,null,null,null,null,null,null,null,null,21,"Les calculs se feront automatiquement."]
[null,null,null,null,null,null,null,null,null,null,null,null,null,null,null,null,null,null,22,"Et les équipes se positionneront dans le tableau final."]
[null,null,null,null,null,null,null,null,null,null,null,null,null,null,null,null,null,null,23,"Avec le seul tableau respectant le règlement jusqu'au tirage au sort !"]
[null,null,null,null,null,null,null,null,null,null,null,null,null,null,null,null,null,null,24,"Si vous n'arrivez pas à lire correctement ce tableau  :"]
[null,null,null,null,null,null,null,null,null,null,null,null,null,null,null,null,null,null,25,"Ne pas toucher cette partie des calculs, sinon :"]
[null,null,null,null,null,null,null,null,null,null,null,null,null,null,null,null,null,null,26,"à","(2 à 0)"]
[null,null,null,null,null,null,null,null,null,null,null,null,null,null,null,null,null,null,27,"Les Pronostics"]

{"sheet":"Debug","index":4,"n_rows":2,"n_cols":2,"rows_kept":2,"cut":false,"hidden":true,"merged":[]}
["Publish Url","http://apipronosticseuro2012.cloudapp.net/publish/publish?id=9A99BCB6-BD58-4412-9424-C26C4ADA32D7"]
[null,"scores=%5B%7B%22GameId%22%3A1%2C%22ScoreTeam1%22%3A1%2C%22ScoreTeam2%22%3A0%2C%22PenaltyTeam1%22%3A0%2C%22PenaltyTeam2%22%3A0%7D%2C%7B%22GameId%22%3A2%2C%22ScoreTeam1%22%3A1%2C%22ScoreTeam2%22%3A1%2C%22PenaltyTeam1%22%3A0%2C%22PenaltyTeam2%22%3A0%7D%2C%7B%22GameId%22%3A3%2C%22ScoreTeam1%22%3A0%2C%22ScoreTeam2%22%3A2%2C%22PenaltyTeam1%22%3A0%2C%22PenaltyTeam2%22%3A0%7D%2C%7B%22GameId%22%3A4%2C%22ScoreTeam1%22%3A1%2C%22ScoreTeam2%22%3A2%2C%22PenaltyTeam1%22%3A0%2C%22PenaltyTeam2%22%3A0%7D%2C%7B%22GameId%22%3A5%2C%22ScoreTeam1%22%3A0%2C%22ScoreTeam2%22%3A2%2C%22PenaltyTeam1%22%3A0%2C%22PenaltyTeam2%22%3A0%7D%2C%7B%22GameId%22%3A6%2C%22ScoreTeam1%22%3A1%2C%22ScoreTeam2%22%3A1%2C%22PenaltyTeam1%22%3A0%2C%22PenaltyTeam2%22%3A0%7D%2C%7B%22GameId%22%3A7%2C%22ScoreTeam1%22%3A0%2C%22ScoreTeam2%22%3A2%2C%22PenaltyTeam1%22%3A0%2C%22PenaltyTeam2%22%3A0%7D%2C%7B%22GameId%22%3A8%2C%22ScoreTeam1%22%3A1%2C%22ScoreTeam2%22%3A1%2C%22PenaltyTeam1%22%3A0%2C%22PenaltyTeam2%22%3A0%7D%2C%7B%22GameId%22%3A9%2C%22ScoreTeam1%22%3A1%2C%22ScoreTeam2%22%3A1%2C%22PenaltyTeam1%22%3A0%2C%22PenaltyTeam2%22%3A0%7D%2C%7B%22GameId%22%3A10%2C%22ScoreTeam1%22%3A1%2C%22ScoreTeam2%22%3A1%2C%22PenaltyTeam1%22%3A0%2C%22PenaltyTeam2%22%3A0%7D%2C%7B%22GameId%22%3A11%2C%22ScoreTeam1%22%3A0%2C%22ScoreTeam2%22%3A2%2C%22PenaltyTeam1%22%3A0%2C%22PenaltyTeam2%22%3A0%7D%2C%7B%22GameId%22%3A12%2C%22ScoreTeam1%22%3A0%2C%22ScoreTeam2%22%3A1%2C%22PenaltyTeam1%22%3A0%2C%22PenaltyTeam2%22%3A0%7D%2C%7B%22GameId%22%3A13%2C%22ScoreTeam1%22%3A1%2C%22ScoreTeam2%22%3A1%2C%22PenaltyTeam1%22%3A0%2C%22PenaltyTeam2%22%3A0%7D%2C%7B%22GameId%22%3A14%2C%22ScoreTeam1%22%3A1%2C%22ScoreTeam2%22%3A1%2C%22PenaltyTeam1%22%3A0%2C%22PenaltyTeam2%22%3A0%7D%2C%7B%22GameId%22%3A15%2C%22ScoreTeam1%22%3A0%2C%22ScoreTeam2%22%3A1%2C%22PenaltyTeam1%22%3A0%2C%22PenaltyTeam2%22%3A0%7D%2C%7B%22GameId%22%3A16%2C%22ScoreTeam1%22%3A1%2C%22ScoreTeam2%22%3A1%2C%22PenaltyTeam1%22%3A0%2C%22PenaltyTeam2%22%3A0%7D%2C%7B%22GameId%22%3A17%2C%22ScoreTeam1%22%3A0%2C%22ScoreTeam2%22%3A1%2C%22PenaltyTeam1%22%3A0%2C%22PenaltyTeam2%22%3A0%7D%2C%7B%22GameId%22%3A18%2C%22ScoreTeam1%22%3A1%2C%22ScoreTeam2%22%3A1%2C%22PenaltyTeam1%22%3A0%2C%22PenaltyTeam2%22%3A0%7D%2C%7B%22GameId%22%3A19%2C%22ScoreTeam1%22%3A3%2C%22ScoreTeam2%22%3A0%2C%22PenaltyTeam1%22%3A0%2C%22PenaltyTeam2%22%3A0%7D%2C%7B%22GameId%22%3A20%2C%22ScoreTeam1%22%3A1%2C%22ScoreTeam2%22%3A1%2C%22PenaltyTeam1%22%3A0%2C%22PenaltyTeam2%22%3A0%7D%2C%7B%22GameId%22%3A21%2C%22ScoreTeam1%22%3A0%2C%22ScoreTeam2%22%3A1%2C%22PenaltyTeam1%22%3A0%2C%22PenaltyTeam2%22%3A0%7D%2C%7B%22GameId%22%3A22%2C%22ScoreTeam1%22%3A1%2C%22ScoreTeam2%22%3A1%2C%22PenaltyTeam1%22%3A0%2C%22PenaltyTeam2%22%3A0%7D%2C%7B%22GameId%22%3A23%2C%22ScoreTeam1%22%3A1%2C%22ScoreTeam2%22%3A1%2C%22PenaltyTeam1%22%3A0%2C%22PenaltyTeam2%22%3A0%7D%2C%7B%22GameId%22%3A24%2C%22ScoreTeam1%22%3A1%2C%22ScoreTeam2%22%3A1%2C%22PenaltyTeam1%22%3A0%2C%22PenaltyTeam2%22%3A0%7D%5D"]

{"sheet":"Temp","index":5,"n_rows":3,"n_cols":16,"rows_kept":3,"cut":false,"hidden":true,"merged":[]}
["PublishResult",null,null,null,"[{\"GameId\":1,\"ScoreTeam1\":1,\"ScoreTeam2\":0,\"PenaltyTeam1\":0,\"PenaltyTeam2\":0},{\"GameId\":2,\"ScoreTeam1\":1,\"ScoreTeam2\":1,\"PenaltyTeam1\":0,\"PenaltyTeam2\":0},{\"GameId\":3,\"ScoreTeam1\":0,\"ScoreTeam2\":2,\"PenaltyTeam1\":0,\"PenaltyTeam2\":0},{\"GameId\":4,\"ScoreTeam1\":1,\"ScoreTeam2\":2,\"PenaltyTeam1\":0,\"PenaltyTeam2\":0},{\"GameId\":5,\"ScoreTeam1\":0,\"ScoreTeam2\":2,\"PenaltyTeam1\":0,\"PenaltyTeam2\":0},{\"GameId\":6,\"ScoreTeam1\":1,\"ScoreTeam2\":1,\"PenaltyTeam1\":0,\"PenaltyTeam2\":0},{\"GameId\":7,\"ScoreTeam1\":2,\"ScoreTeam2\":0,\"PenaltyTeam1\":0,\"PenaltyTeam2\":0},{\"GameId\":8,\"ScoreTeam1\":0,\"ScoreTeam2\":0,\"PenaltyTeam1\":0,\"PenaltyTeam2\":0},{\"GameId\":9,\"ScoreTeam1\":1,\"ScoreTeam2\":1,\"PenaltyTeam1\":0,\"PenaltyTeam2\":0},{\"GameId\":10,\"ScoreTeam1\":1,\"ScoreTeam2\":1,\"PenaltyTeam1\":0,\"PenaltyTeam2\":0},{\"GameId\":11,\"ScoreTeam1\":0,\"ScoreTeam2\":2,\"PenaltyTeam1\":0,\"PenaltyTeam2\":0},{\"GameId\":12,\"ScoreTeam1\":0,\"ScoreTeam2\":1,\"PenaltyTeam1\":0,\"PenaltyTeam2\":0},{\"GameId\":13,\"ScoreTeam1\":1,\"ScoreTeam2\":1,\"PenaltyTeam1\":0,\"PenaltyTeam2\":0},{\"GameId\":14,\"ScoreTeam1\":1,\"ScoreTeam2\":1,\"PenaltyTeam1\":0,\"PenaltyTeam2\":0},{\"GameId\":15,\"ScoreTeam1\":0,\"ScoreTeam2\":1,\"PenaltyTeam1\":0,\"PenaltyTeam2\":0},{\"GameId\":16,\"ScoreTeam1\":1,\"ScoreTeam2\":1,\"PenaltyTeam1\":0,\"PenaltyTeam2\":0},{\"GameId\":17,\"ScoreTeam1\":0,\"ScoreTeam2\":1,\"PenaltyTeam1\":0,\"PenaltyTeam2\":0},{\"GameId\":18,\"ScoreTeam1\":1,\"ScoreTeam2\":1,\"PenaltyTeam1\":0,\"PenaltyTeam2\":0},{\"GameId\":19,\"ScoreTeam1\":3,\"ScoreTeam2\":0,\"PenaltyTeam1\":0,\"PenaltyTeam2\":0},{\"GameId\":20,\"ScoreTeam1\":1,\"ScoreTeam2\":1,\"PenaltyTeam1\":0,\"PenaltyTeam2\":0},{\"GameId\":21,\"ScoreTeam1\":0,\"ScoreTeam2\":1,\"PenaltyTeam1\":0,\"PenaltyTeam2\":0},{\"GameId\":22,\"ScoreTeam1\":1,\"ScoreTeam2\":1,\"PenaltyTeam1\":0,\"PenaltyTeam2\":0},{\"GameId\":23,\"ScoreTeam1\":1,\"ScoreTeam2\":1,\"PenaltyTeam1\":0,\"PenaltyTeam2\":0},{\"GameId\":24,\"ScoreTeam1\":1,\"ScoreTeam2\":1,\"PenaltyTeam1\":0,\"PenaltyTeam2\":0},{\"GameId\":25,\"ScoreTeam1\":1,\"ScoreTeam2\":2,\"PenaltyTeam1\":0,\"PenaltyTeam2\":0},{\"GameId\":26,\"ScoreTeam1\":2,\"ScoreTeam2\":0,\"PenaltyTeam1\":0,\"PenaltyTeam2\":0},{\"GameId\":27,\"ScoreTeam1\":2,\"ScoreTeam2\":0,\"PenaltyTeam1\":0,\"PenaltyTeam2\":0},{\"GameId\":28,\"ScoreTeam1\":2,\"ScoreTeam2\":1,\"PenaltyTeam1\":0,\"PenaltyTeam2\":0},{\"GameId\":29,\"ScoreTeam1\":2,\"ScoreTeam2\":1,\"PenaltyTeam1\":0,\"PenaltyTeam2\":0},{\"GameId\":30,\"ScoreTeam1\":2,\"ScoreTeam2\":1,\"PenaltyTeam1\":0,\"PenaltyTeam2\":0},{\"GameId\":32,\"ScoreTeam1\":1,\"ScoreTeam2\":2,\"PenaltyTeam1\":0,\"PenaltyTeam2\":0}] ",null,null,null,"[{\"GameId\":1,\"ScoreTeam1\":1,\"ScoreTeam2\":0,\"PenaltyTeam1\":0,\"PenaltyTeam2\":0},{\"GameId\":2,\"ScoreTeam1\":1,\"ScoreTeam2\":1,\"PenaltyTeam1\":0,\"PenaltyTeam2\":0},{\"GameId\":3,\"ScoreTeam1\":0,\"ScoreTeam2\":2,\"PenaltyTeam1\":0,\"PenaltyTeam2\":0},{\"GameId\":4,\"ScoreTeam1\":1,\"ScoreTeam2\":2,\"PenaltyTeam1\":0,\"PenaltyTeam2\":0},{\"GameId\":5,\"ScoreTeam1\":0,\"ScoreTeam2\":2,\"PenaltyTeam1\":0,\"PenaltyTeam2\":0},{\"GameId\":6,\"ScoreTeam1\":1,\"ScoreTeam2\":1,\"PenaltyTeam1\":0,\"PenaltyTeam2\":0},{\"GameId\":7,\"ScoreTeam1\":0,\"ScoreTeam2\":2,\"PenaltyTeam1\":0,\"PenaltyTeam2\":0},{\"GameId\":8,\"ScoreTeam1\":1,\"ScoreTeam2\":1,\"PenaltyTeam1\":0,\"PenaltyTeam2\":0},{\"GameId\":9,\"ScoreTeam1\":1,\"ScoreTeam2\":0,\"PenaltyTeam1\":0,\"PenaltyTeam2\":0},{\"GameId\":10,\"ScoreTeam1\":2,\"ScoreTeam2\":3,\"PenaltyTeam1\":0,\"PenaltyTeam2\":0},{\"GameId\":11,\"ScoreTeam1\":0,\"ScoreTeam2\":2,\"PenaltyTeam1\":0,\"PenaltyTeam2\":0},{\"GameId\":12,\"ScoreTeam1\":0,\"ScoreTeam2\":1,\"PenaltyTeam1\":0,\"PenaltyTeam2\":0},{\"GameId\":13,\"ScoreTeam1\":1,\"ScoreTeam2\":1,\"PenaltyTeam1\":0,\"PenaltyTeam2\":0},{\"GameId\":14,\"ScoreTeam1\":1,\"ScoreTeam2\":1,\"PenaltyTeam1\":0,\"PenaltyTeam2\":0},{\"GameId\":15,\"ScoreTeam1\":1,\"ScoreTeam2\":0,\"PenaltyTeam1\":0,\"PenaltyTeam2\":0},{\"GameId\":16,\"ScoreTeam1\":3,\"ScoreTeam2\":0,\"PenaltyTeam1\":0,\"PenaltyTeam2\":0},{\"GameId\":17,\"ScoreTeam1\":0,\"ScoreTeam2\":2,\"PenaltyTeam1\":0,\"PenaltyTeam2\":0},{\"GameId\":18,\"ScoreTeam1\":1,\"ScoreTeam2\":1,\"PenaltyTeam1\":0,\"PenaltyTeam2\":0},{\"GameId\":19,\"ScoreTeam1\":3,\"ScoreTeam2\":0,\"PenaltyTeam1\":0,\"PenaltyTeam2\":0},{\"GameId\":20,\"ScoreTeam1\":1,\"ScoreTeam2\":1,\"PenaltyTeam1\":0,\"PenaltyTeam2\":0},{\"GameId\":21,\"ScoreTeam1\":0,\"ScoreTeam2\":1,\"PenaltyTeam1\":0,\"PenaltyTeam2\":0},{\"GameId\":22,\"ScoreTeam1\":0,\"ScoreTeam2\":1,\"PenaltyTeam1\":0,\"PenaltyTeam2\":0},{\"GameId\":23,\"ScoreTeam1\":1,\"ScoreTeam2\":1,\"PenaltyTeam1\":0,\"PenaltyTeam2\":0},{\"GameId\":24,\"ScoreTeam1\":1,\"ScoreTeam2\":1,\"PenaltyTeam1\":0,\"PenaltyTeam2\":0},{\"GameId\":25,\"ScoreTeam1\":2,\"ScoreTeam2\":0,\"PenaltyTeam1\":0,\"PenaltyTeam2\":0},{\"GameId\":26,\"ScoreTeam1\":4,\"ScoreTeam2\":0,\"PenaltyTeam1\":0,\"PenaltyTeam2\":0},{\"GameId\":27,\"ScoreTeam1\":2,\"ScoreTeam2\":1,\"PenaltyTeam1\":0,\"PenaltyTeam2\":0},{\"GameId\":28,\"ScoreTeam1\":1,\"ScoreTeam2\":1,\"PenaltyTeam1\":5,\"PenaltyTeam2\":3},{\"GameId\":29,\"ScoreTeam1\":1,\"ScoreTeam2\":3,\"PenaltyTeam1\":0,\"PenaltyTeam2\":0},{\"GameId\":30,\"ScoreTeam1\":1,\"ScoreTeam2\":0,\"PenaltyTeam1\":0,\"PenaltyTeam2\":0},{\"GameId\":32,\"ScoreTeam1\":2,\"ScoreTeam2\":0,\"PenaltyTeam1\":0,\"PenaltyTeam2\":0}] ",null,"[{\"GameId\":1,\"ScoreTeam1\":1,\"ScoreTeam2\":0,\"PenaltyTeam1\":0,\"PenaltyTeam2\":0},{\"GameId\":2,\"ScoreTeam1\":1,\"ScoreTeam2\":1,\"PenaltyTeam1\":0,\"PenaltyTeam2\":0},{\"GameId\":3,\"ScoreTeam1\":0,\"ScoreTeam2\":2,\"PenaltyTeam1\":0,\"PenaltyTeam2\":0},{\"GameId\":4,\"ScoreTeam1\":1,\"ScoreTeam2\":2,\"PenaltyTeam1\":0,\"PenaltyTeam2\":0},{\"GameId\":5,\"ScoreTeam1\":0,\"ScoreTeam2\":2,\"PenaltyTeam1\":0,\"PenaltyTeam2\":0},{\"GameId\":6,\"ScoreTeam1\":1,\"ScoreTeam2\":1,\"PenaltyTeam1\":0,\"PenaltyTeam2\":0},{\"GameId\":7,\"ScoreTeam1\":1,\"ScoreTeam2\":1,\"PenaltyTeam1\":0,\"PenaltyTeam2\":0},{\"GameId\":8,\"ScoreTeam1\":1,\"ScoreTeam2\":1,\"PenaltyTeam1\":0,\"PenaltyTeam2\":0},{\"GameId\":9,\"ScoreTeam1\":1,\"ScoreTeam2\":0,\"PenaltyTeam1\":0,\"PenaltyTeam2\":0},{\"GameId\":10,\"ScoreTeam1\":2,\"ScoreTeam2\":3,\"PenaltyTeam1\":0,\"PenaltyTeam2\":0},{\"GameId\":11,\"ScoreTeam1\":0,\"ScoreTeam2\":2,\"PenaltyTeam1\":0,\"PenaltyTeam2\":0},{\"GameId\":12,\"ScoreTeam1\":0,\"ScoreTeam2\":1,\"PenaltyTeam1\":0,\"PenaltyTeam2\":0},{\"GameId\":13,\"ScoreTeam1\":1,\"ScoreTeam2\":1,\"PenaltyTeam1\":0,\"PenaltyTeam2\":0},{\"GameId\":14,\"ScoreTeam1\":1,\"ScoreTeam2\":1,\"PenaltyTeam1\":0,\"PenaltyTeam2\":0},{\"GameId\":15,\"ScoreTeam1\":1,\"ScoreTeam2\":0,\"PenaltyTeam1\":0,\"PenaltyTeam2\":0},{\"GameId\":16,\"ScoreTeam1\":3,\"ScoreTeam2\":0,\"PenaltyTeam1\":0,\"PenaltyTeam2\":0},{\"GameId\":17,\"ScoreTeam1\":0,\"ScoreTeam2\":2,\"PenaltyTeam1\":0,\"PenaltyTeam2\":0},{\"GameId\":18,\"ScoreTeam1\":1,\"ScoreTeam2\":1,\"PenaltyTeam1\":0,\"PenaltyTeam2\":0},{\"GameId\":19,\"ScoreTeam1\":3,\"ScoreTeam2\":0,\"PenaltyTeam1\":0,\"PenaltyTeam2\":0},{\"GameId\":20,\"ScoreTeam1\":1,\"ScoreTeam2\":1,\"PenaltyTeam1\":0,\"PenaltyTeam2\":0},{\"GameId\":21,\"ScoreTeam1\":0,\"ScoreTeam2\":1,\"PenaltyTeam1\":0,\"PenaltyTeam2\":0},{\"GameId\":22,\"ScoreTeam1\":0,\"ScoreTeam2\":1,\"PenaltyTeam1\":0,\"PenaltyTeam2\":0},{\"GameId\":23,\"ScoreTeam1\":1,\"ScoreTeam2\":1,\"PenaltyTeam1\":0,\"PenaltyTeam2\":0},{\"GameId\":24,\"ScoreTeam1\":1,\"ScoreTeam2\":1,\"PenaltyTeam1\":0,\"PenaltyTeam2\":0},{\"GameId\":25,\"ScoreTeam1\":2,\"ScoreTeam2\":0,\"PenaltyTeam1\":0,\"PenaltyTeam2\":0},{\"GameId\":26,\"ScoreTeam1\":4,\"ScoreTeam2\":0,\"PenaltyTeam1\":0,\"PenaltyTeam2\":0},{\"GameId\":27,\"ScoreTeam1\":2,\"ScoreTeam2\":1,\"PenaltyTeam1\":0,\"PenaltyTeam2\":0},{\"GameId\":28,\"ScoreTeam1\":1,\"ScoreTeam2\":1,\"PenaltyTeam1\":5,\"PenaltyTeam2\":3},{\"GameId\":29,\"ScoreTeam1\":1,\"ScoreTeam2\":3,\"PenaltyTeam1\":0,\"PenaltyTeam2\":0},{\"GameId\":30,\"ScoreTeam1\":1,\"ScoreTeam2\":0,\"PenaltyTeam1\":0,\"PenaltyTeam2\":0},{\"GameId\":32,\"ScoreTeam1\":2,\"ScoreTeam2\":0,\"PenaltyTeam1\":0,\"PenaltyTeam2\":0}] ",null,null,null,null,"[{\"GameId\":1,\"ScoreTeam1\":1,\"ScoreTeam2\":1,\"PenaltyTeam1\":0,\"PenaltyTeam2\":0},{\"GameId\":2,\"ScoreTeam1\":1,\"ScoreTeam2\":1,\"PenaltyTeam1\":0,\"PenaltyTeam2\":0},{\"GameId\":3,\"ScoreTeam1\":1,\"ScoreTeam2\":1,\"PenaltyTeam1\":0,\"PenaltyTeam2\":0},{\"GameId\":4,\"ScoreTeam1\":1,\"ScoreTeam2\":1,\"PenaltyTeam1\":0,\"PenaltyTeam2\":0},{\"GameId\":5,\"ScoreTeam1\":1,\"ScoreTeam2\":0,\"PenaltyTeam1\":0,\"PenaltyTeam2\":0},{\"GameId\":6,\"ScoreTeam1\":1,\"ScoreTeam2\":2,\"PenaltyTeam1\":0,\"PenaltyTeam2\":0},{\"GameId\":7,\"ScoreTeam1\":1,\"ScoreTeam2\":1,\"PenaltyTeam1\":0,\"PenaltyTeam2\":0},{\"GameId\":8,\"ScoreTeam1\":2,\"ScoreTeam2\":1,\"PenaltyTeam1\":0,\"PenaltyTeam2\":0},{\"GameId\":9,\"ScoreTeam1\":2,\"ScoreTeam2\":0,\"PenaltyTeam1\":0,\"PenaltyTeam2\":0},{\"GameId\":10,\"ScoreTeam1\":1,\"ScoreTeam2\":1,\"PenaltyTeam1\":0,\"PenaltyTeam2\":0},{\"GameId\":11,\"ScoreTeam1\":1,\"ScoreTeam2\":1,\"PenaltyTeam1\":0,\"PenaltyTeam2\":0},{\"GameId\":12,\"ScoreTeam1\":1,\"ScoreTeam2\":1,\"PenaltyTeam1\":0,\"PenaltyTeam2\":0},{\"GameId\":13,\"ScoreTeam1\":1,\"ScoreTeam2\":1,\"PenaltyTeam1\":0,\"PenaltyTeam2\":0},{\"GameId\":14,\"ScoreTeam1\":1,\"ScoreTeam2\":0,\"PenaltyTeam1\":0,\"PenaltyTeam2\":0},{\"GameId\":15,\"ScoreTeam1\":0,\"ScoreTeam2\":1,\"PenaltyTeam1\":0,\"PenaltyTeam2\":0},{\"GameId\":16,\"ScoreTeam1\":2,\"ScoreTeam2\":0,\"PenaltyTeam1\":0,\"PenaltyTeam2\":0},{\"GameId\":17,\"ScoreTeam1\":1,\"ScoreTeam2\":1,\"PenaltyTeam1\":0,\"PenaltyTeam2\":0},{\"GameId\":18,\"ScoreTeam1\":1,\"ScoreTeam2\":1,\"PenaltyTeam1\":0,\"PenaltyTeam2\":0},{\"GameId\":19,\"ScoreTeam1\":1,\"ScoreTeam2\":0,\"PenaltyTeam1\":0,\"PenaltyTeam2\":0},{\"GameId\":20,\"ScoreTeam1\":1,\"ScoreTeam2\":1,\"PenaltyTeam1\":0,\"PenaltyTeam2\":0},{\"GameId\":21,\"ScoreTeam1\":0,\"ScoreTeam2\":1,\"PenaltyTeam1\":0,\"PenaltyTeam2\":0},{\"GameId\":22,\"ScoreTeam1\":1,\"ScoreTeam2\":1,\"PenaltyTeam1\":0,\"PenaltyTeam2\":0},{\"GameId\":23,\"ScoreTeam1\":1,\"ScoreTeam2\":1,\"PenaltyTeam1\":0,\"PenaltyTeam2\":0},{\"GameId\":24,\"ScoreTeam1\":1,\"ScoreTeam2\":1,\"PenaltyTeam1\":0,\"PenaltyTeam2\":0}] "]
["Consolidate","[{\"GameId\":1,\"Score\":[47,50,19,1,0,0,331,156,52,3,0,2,140,172,13,3,0,1,11,11,4,1,1,1,1,3,2,0,0,0,3,0,0,0,0,0]},{\"GameId\":2,\"Score\":[22,55,53,4,0,0,130,190,98,9,0,0,96,205,49,8,0,0,10,40,15,3,1,0,0,8,0,0,0,0,1,0,0,0,1,2]},{\"GameId\":3,\"Score\":[90,220,214,30,5,1,74,140,136,55,1,0,22,41,41,6,1,0,6,8,5,0,1,1,2,1,0,1,0,1,0,1,0,0,0,0]},{\"GameId\":4,\"Score\":[93,139,127,18,1,0,85,282,164,50,1,0,19,59,49,11,0,0,2,9,4,0,0,0,0,1,1,0,1,0,0,0,0,0,0,1]},{\"GameId\":5,\"Score\":[71,160,233,88,8,2,68,136,159,83,8,0,24,33,29,13,0,1,3,6,2,0,0,0,3,1,1,1,0,0,1,3,0,0,1,2]},{\"GameId\":6,\"Score\":[95,104,54,2,0,0,134,272,117,22,1,1,63,131,77,10,0,0,18,24,6,1,0,0,1,0,3,0,0,0,0,0,1,0,0,2]},{\"GameId\":7,\"Score\":[10,7,3,1,0,1,61,32,7,0,0,0,308,146,17,4,0,0,126,193,15,1,1,0,19,19,3,0,1,0,3,1,1,0,0,0]},{\"GameId\":8,\"Score\":[18,15,2,0,0,0,83,107,32,7,0,0,107,310,94,9,0,0,17,109,58,7,1,0,3,5,4,0,0,1,0,0,0,0,0,0]},{\"GameId\":9,\"Score\":[36,218,230,52,3,4,43,117,226,66,8,1,6,36,38,12,4,0,0,3,1,0,0,0,1,0,0,0,1,1,0,1,0,0,0,0]},{\"GameId\":10,\"Score\":[22,67,39,3,2,0,30,235,208,34,1,0,16,76,263,60,5,0,0,11,27,7,1,0,0,0,1,1,1,1,0,1,1,0,0,0]},{\"GameId\":11,\"Score\":[36,98,81,14,1,0,46,210,248,91,4,1,21,83,104,42,8,1,1,9,8,5,2,0,1,1,3,0,0,0,0,0,0,0,1,0]},{\"GameId\":12,\"Score\":[17,117,322,176,43,3,8,69,135,138,35,3,6,10,10,13,6,0,0,3,2,0,1,0,0,0,0,1,0,0,0,1,0,0,0,1]},{\"GameId\":13,\"Score\":[51,24,1,0,0,0,123,121,23,2,0,0,174,260,42,4,0,0,23,94,33,0,2,0,2,7,2,1,0,1,0,0,0,0,0,0]},{\"GameId\":14,\"Score\":[93,212,117,12,1,1,90,186,133,32,1,0,21,45,30,5,0,0,2,1,3,1,0,0,1,0,1,0,0,0,0,0,0,1,0,0]},{\"GameId\":15,\"Score\":[62,47,11,0,0,0,212,262,53,5,0,1,86,235,59,4,2,1,18,31,10,0,0,0,0,3,0,0,0,1,0,0,0,0,0,0]},{\"GameId\":16,\"Score\":[4,3,0,0,0,0,91,17,7,1,0,0,345,80,3,2,0,0,291,126,3,0,0,0,76,45,2,1,0,1,9,1,0,0,0,0]},{\"GameId\":17,\"Score\":[22,134,239,76,20,2,8,89,286,134,17,1,2,8,28,22,2,0,0,1,2,0,0,0,0,0,0,0,0,0,0,0,0,2,0,0]},{\"GameId\":18,\"Score\":[48,26,1,1,0,0,279,135,18,1,0,0,271,178,35,3,0,0,45,37,13,0,0,0,1,1,0,1,0,0,0,1,1,0,0,0]},{\"GameId\":19,\"Score\":[40,28,16,1,0,0,150,187,52,3,2,0,154,315,48,2,2,0,6,37,11,3,1,0,0,2,3,0,0,0,1,0,0,0,0,1]},{\"GameId\":20,\"Score\":[67,152,104,13,1,0,109,284,146,34,2,0,38,74,28,7,0,0,2,5,4,0,0,0,0,1,0,0,0,0,0,0,1,0,0,1]},{\"GameId\":21,\"Score\":[31,231,271,60,1,0,9,131,216,104,4,0,5,13,20,14,0,0,1,1,0,0,0,0,0,0,0,0,0,0,0,1,1,1,0,0]},{\"GameId\":22,\"Score\":[40,168,138,19,0,0,51,216,225,51,1,0,19,73,80,18,4,0,2,2,4,2,0,0,0,1,1,0,0,0,0,0,0,0,1,0]},{\"GameId\":23,\"Score\":[40,176,118,18,1,1,27,262,254,87,3,0,7,20,53,24,3,0,0,3,1,2,0,0,1,1,0,0,0,0,0,0,0,0,0,0]},{\"GameId\":24,\"Score\":[33,24,11,1,0,0,234,121,41,6,0,0,243,183,41,4,0,0,60,76,10,0,0,0,2,5,1,2,0,0,0,2,0,0,0,0]},{\"GameId\":25,\"Score\":[6,77,164,28,1,0,19,33,266,124,9,2,14,41,33,31,5,0,0,3,7,0,0,0,0,1,0,0,0,0,0,0,0,0,0,0]},{\"GameId\":26,\"Score\":[2,4,0,1,0,0,54,12,7,1,0,0,269,120,9,0,0,0,131,178,24,1,0,0,22,18,4,0,0,0,4,1,0,0,0,0]},{\"GameId\":27,\"Score\":[19,17,2,1,1,0,85,57,32,3,0,0,145,218,24,11,0,0,39,146,32,1,0,1,6,10,7,0,1,0,0,0,3,0,1,0]},{\"GameId\":28,\"Score\":[32,38,14,0,1,0,174,118,51,7,0,0,93,229,30,3,0,0,7,39,16,1,0,0,1,2,1,2,1,0,2,0,1,0,0,0]},{\"GameId\":29,\"Score\":[15,89,59,4,4,0,36,70,207,42,0,0,22,104,74,80,4,0,2,8,17,2,3,1,0,0,1,1,0,0,0,0,0,0,1,0]},{\"GameId\":30,\"Score\":[16,79,17,1,2,0,92,66,110,22,0,0,81,179,44,41,0,0,16,43,26,4,2,0,0,2,1,1,0,0,0,0,0,0,0,0]},{\"GameId\":31,\"Score\":[0,0,0,0,0,0,0,0,0,0,0,0,0,0,0,0,0,0,0,0,0,0,0,0,0,0,0,0,0,0,0,0,0,0,0,0]},{\"GameId\":32,\"Score\":[13,81,50,13,1,0,96,44,185,29,2,0,48,146,18,26,2,1,7,26,24,3,0,0,0,1,1,1,1,2,1,0,0,0,0,0]}] ",null,null,null,"[{\"GameId\":1,\"Score\":[47,50,19,1,0,0,331,156,52,3,0,2,140,172,13,3,0,1,11,11,4,1,1,1,1,3,2,0,0,0,3,0,0,0,0,0]},{\"GameId\":2,\"Score\":[22,55,53,4,0,0,130,190,98,9,0,0,96,205,49,8,0,0,10,40,15,3,1,0,0,8,0,0,0,0,1,0,0,0,1,2]},{\"GameId\":3,\"Score\":[79,191,191,27,4,1,60,118,117,52,1,0,16,33,33,5,1,0,5,6,3,0,1,1,1,1,0,1,0,1,0,1,0,0,0,0]},{\"GameId\":4,\"Score\":[82,115,101,14,0,0,79,255,127,39,0,0,17,55,43,8,0,0,1,9,2,0,0,0,0,1,1,0,1,0,0,0,0,0,0,1]},{\"GameId\":5,\"Score\":[60,137,196,72,6,2,60,125,125,60,7,0,22,28,24,9,0,1,1,5,1,0,0,0,1,1,1,1,0,0,1,3,0,0,1,1]},{\"GameId\":6,\"Score\":[82,82,45,2,0,0,113,241,88,21,1,1,49,107,66,6,0,0,15,22,3,0,0,0,1,0,3,0,0,0,0,0,1,0,0,2]},{\"GameId\":7,\"Score\":[10,6,3,1,0,1,61,32,7,0,0,0,308,147,17,4,0,0,126,192,15,1,1,0,19,19,3,0,1,0,3,1,1,0,0,0]},{\"GameId\":8,\"Score\":[16,15,2,0,0,0,76,107,32,7,0,0,106,312,94,9,0,0,15,109,58,7,1,0,3,5,4,0,0,1,0,0,0,0,0,0]},{\"GameId\":9,\"Score\":[30,187,194,41,2,4,36,100,188,60,7,1,6,29,28,8,4,0,0,3,1,0,0,0,0,0,0,0,1,1,0,1,0,0,0,0]},{\"GameId\":10,\"Score\":[13,56,25,1,2,0,26,208,167,28,1,0,11,62,228,55,5,0,0,10,21,7,1,0,0,0,1,1,1,1,0,1,1,0,0,0]},{\"GameId\":11,\"Score\":[28,79,76,13,1,0,34,179,208,79,4,1,11,61,84,38,8,1,0,9,8,4,2,0,1,1,2,0,0,0,0,0,0,0,1,0]},{\"GameId\":12,\"Score\":[9,90,266,160,36,3,5,60,112,114,34,2,5,8,7,10,4,0,0,3,2,0,1,0,0,0,0,1,0,0,0,1,0,0,0,1]},{\"GameId\":13,\"Score\":[49,24,1,0,0,0,121,112,22,2,0,0,169,257,39,4,0,0,23,93,31,0,2,0,2,7,2,1,0,1,0,0,0,0,0,0]},{\"GameId\":14,\"Score\":[93,204,114,12,1,0,87,182,128,25,1,0,20,44,30,5,0,0,2,1,3,1,0,0,1,0,1,0,0,0,0,0,0,1,0,0]},{\"GameId\":15,\"Score\":[55,44,8,0,0,0,182,228,40,4,0,1,68,186,43,6,1,1,13,29,7,0,0,0,0,2,0,0,0,1,0,0,0,0,0,0]},{\"GameId\":16,\"Score\":[1,3,0,0,0,0,80,15,5,1,0,0,288,67,4,2,0,0,239,108,2,0,0,0,57,31,1,1,0,1,9,1,0,0,0,0]},{\"GameId\":17,\"Score\":[16,107,196,69,18,2,7,78,231,120,14,1,1,5,23,19,2,0,0,1,2,0,0,0,0,0,0,0,0,0,0,0,0,2,0,0]},{\"GameId\":18,\"Score\":[42,24,1,0,0,0,236,114,18,1,0,0,213,146,32,2,0,0,37,31,11,0,0,0,2,2,0,1,0,0,0,1,1,0,0,0]},{\"GameId\":19,\"Score\":[38,24,11,0,0,0,141,160,46,3,2,0,139,280,45,3,2,0,4,36,11,2,1,0,0,2,3,0,0,0,1,0,0,0,0,1]},{\"GameId\":20,\"Score\":[61,133,93,12,1,0,91,258,131,30,2,0,33,61,26,7,0,0,2,5,4,0,0,0,0,1,0,0,0,0,0,0,1,0,0,1]},{\"GameId\":21,\"Score\":[24,204,226,50,1,0,8,109,166,85,4,0,5,10,15,11,0,0,1,1,0,0,0,0,0,0,0,0,0,0,0,0,1,1,0,0]},{\"GameId\":22,\"Score\":[26,148,115,16,0,0,36,179,183,48,1,0,14,58,68,15,4,0,2,2,2,1,0,0,0,1,1,0,0,0,0,0,0,0,1,0]},{\"GameId\":23,\"Score\":[34,150,91,13,1,1,23,230,210,74,3,0,4,13,46,21,3,0,0,2,1,2,0,0,0,1,0,0,0,0,0,0,0,0,0,0]},{\"GameId\":24,\"Score\":[25,16,10,1,0,0,198,101,31,4,0,0,210,148,39,3,0,0,51,61,10,0,0,0,2,5,1,2,0,0,0,2,0,0,0,0]},{\"GameId\":25,\"Score\":[5,62,144,26,1,0,9,29,217,114,9,2,6,23,25,28,4,0,0,1,5,0,0,0,0,1,0,0,0,0,0,0,0,0,0,0]},{\"GameId\":26,\"Score\":[2,4,0,0,0,0,41,9,6,1,0,0,235,94,6,0,0,0,99,151,18,1,0,0,16,18,3,0,0,0,4,1,0,0,0,0]},{\"GameId\":27,\"Score\":[15,14,1,1,1,0,67,50,25,2,0,0,119,173,23,10,0,0,36,119,29,1,0,1,4,9,6,0,1,0,0,0,2,0,1,0]},{\"GameId\":28,\"Score\":[31,25,9,0,0,0,138,102,39,5,0,0,82,191,28,1,0,0,5,31,15,1,0,0,0,2,1,2,1,0,1,0,1,0,0,0]},{\"GameId\":29,\"Score\":[12,73,44,4,2,0,30,61,166,32,0,0,23,87,64,68,3,0,2,5,17,2,1,1,0,0,0,0,0,0,0,0,0,0,1,0]},{\"GameId\":30,\"Score\":[12,68,13,1,2,0,69,56,91,15,0,0,65,152,38,35,0,0,14,36,20,5,1,0,0,2,1,1,0,0,0,0,0,0,0,0]},{\"GameId\":31,\"Score\":[0,0,0,0,0,0,0,0,0,0,0,0,0,0,0,0,0,0,0,0,0,0,0,0,0,0,0,0,0,0,0,0,0,0,0,0]},{\"GameId\":32,\"Score\":[11,65,39,12,0,0,80,36,150,19,2,0,35,124,17,24,2,1,5,24,21,3,0,0,0,1,1,1,1,2,0,0,0,0,0,0]}] ",null,null,null,"[{\"GameId\":1,\"Score\":[47,50,19,1,0,0,331,156,52,3,0,2,140,172,13,3,0,1,11,11,4,1,1,1,1,3,2,0,0,0,3,0,0,0,0,0]},{\"GameId\":2,\"Score\":[22,55,53,4,0,0,130,190,98,9,0,0,96,205,49,8,0,0,10,40,15,3,1,0,0,8,0,0,0,0,1,0,0,0,1,2]},{\"GameId\":3,\"Score\":[76,187,187,27,4,1,57,118,110,52,1,0,16,32,29,5,1,0,5,7,3,0,1,1,1,1,0,1,0,1,0,1,0,0,0,0]},{\"GameId\":4,\"Score\":[81,112,100,14,0,0,78,250,122,35,0,0,17,51,41,8,0,0,1,9,2,0,0,0,0,1,2,0,1,0,0,0,0,0,0,1]},{\"GameId\":5,\"Score\":[59,132,189,67,6,2,60,122,121,61,7,0,22,28,23,8,0,1,1,5,2,0,0,0,1,1,1,1,0,0,1,3,0,0,1,1]},{\"GameId\":6,\"Score\":[78,77,42,2,0,0,111,236,88,20,1,1,49,104,65,6,0,0,15,21,3,0,0,0,1,0,3,0,0,0,0,0,1,0,0,2]},{\"GameId\":7,\"Score\":[9,4,3,1,0,1,60,31,8,0,0,0,299,142,17,4,0,0,120,187,15,1,1,0,19,19,2,0,1,0,3,1,1,0,0,0]},{\"GameId\":8,\"Score\":[15,15,2,0,0,0,72,106,31,7,0,0,106,299,91,9,0,0,14,106,55,7,1,0,3,5,4,0,0,1,0,0,0,0,0,0]},{\"GameId\":9,\"Score\":[29,183,187,41,2,4,36,98,181,56,7,1,6,28,28,8,4,0,0,3,1,0,0,0,0,0,0,0,0,1,0,1,0,0,0,0]},{\"GameId\":10,\"Score\":[13,52,25,1,2,0,25,198,166,28,1,0,11,60,221,54,5,0,0,10,21,6,1,0,0,0,1,1,1,1,0,1,1,0,0,0]},{\"GameId\":11,\"Score\":[27,76,76,13,0,0,32,172,204,78,4,1,11,56,82,37,8,1,0,9,9,4,2,0,1,1,2,0,0,0,0,0,0,0,0,0]},{\"GameId\":12,\"Score\":[8,90,260,153,35,3,5,57,109,111,32,2,5,7,7,10,4,0,0,3,2,0,1,0,0,0,0,1,0,0,0,1,0,0,0,1]},{\"GameId\":13,\"Score\":[47,24,1,0,0,0,119,108,23,2,0,0,160,252,37,4,0,0,23,89,30,0,2,0,2,7,2,1,0,1,0,0,0,0,0,0]},{\"GameId\":14,\"Score\":[93,199,111,12,1,0,83,180,122,23,1,0,18,42,29,5,0,0,2,1,3,1,0,0,1,0,1,0,0,0,0,0,0,1,0,0]},{\"GameId\":15,\"Score\":[54,42,8,0,0,0,178,220,40,4,0,1,65,182,42,6,0,1,13,27,7,0,0,0,0,2,0,0,0,1,0,0,0,0,0,0]},{\"GameId\":16,\"Score\":[0,3,0,0,0,0,77,14,5,1,0,0,282,63,4,2,0,0,233,105,2,0,0,0,56,32,1,0,0,1,8,1,0,0,0,0]},{\"GameId\":17,\"Score\":[16,105,191,65,17,2,7,77,224,117,14,1,1,5,22,19,1,0,0,0,2,0,0,0,0,0,0,0,0,0,0,0,0,2,0,0]},{\"GameId\":18,\"Score\":[40,24,1,0,0,0,232,111,17,1,0,0,204,143,30,1,0,0,37,30,11,0,0,0,2,2,0,1,0,0,0,1,1,0,0,0]},{\"GameId\":19,\"Score\":[38,24,11,0,0,0,136,156,46,3,2,0,135,269,45,3,2,0,5,34,10,2,1,0,0,2,2,0,0,0,1,0,0,0,0,1]},{\"GameId\":20,\"Score\":[59,132,89,12,1,0,89,251,123,28,2,0,32,62,26,7,0,0,2,4,4,0,0,0,0,1,0,0,0,0,0,0,1,0,0,1]},{\"GameId\":21,\"Score\":[24,202,219,48,1,0,8,104,159,82,4,0,5,10,15,11,0,0,1,1,0,0,0,0,0,0,0,0,0,0,0,0,1,1,0,0]},{\"GameId\":22,\"Score\":[26,146,111,15,0,0,35,172,179,48,1,0,14,56,64,14,4,0,2,2,2,1,0,0,0,1,1,0,0,0,0,0,0,0,1,0]},{\"GameId\":23,\"Score\":[33,148,90,13,1,1,23,222,204,68,3,0,4,14,46,20,2,0,0,1,1,2,0,0,0,1,0,0,0,0,0,0,0,0,0,0]},{\"GameId\":24,\"Score\":[25,15,9,1,0,0,191,103,30,4,0,0,201,143,39,2,0,0,50,60,9,0,0,0,2,5,1,2,0,0,0,2,0,0,0,0]},{\"GameId\":25,\"Score\":[5,59,144,26,1,0,8,29,205,114,9,2,6,21,24,27,4,0,0,1,5,0,0,0,0,1,0,0,0,0,0,0,0,0,0,0]},{\"GameId\":26,\"Score\":[2,4,0,0,0,0,40,9,6,1,0,0,225,92,6,0,0,0,96,147,17,1,0,0,17,18,3,0,0,0,4,1,0,0,0,0]},{\"GameId\":27,\"Score\":[15,13,1,1,1,0,66,50,24,2,0,0,115,168,21,10,0,0,36,114,29,1,0,1,4,9,6,0,0,0,0,0,2,0,1,0]},{\"GameId\":28,\"Score\":[28,24,9,0,0,0,136,100,39,5,0,0,76,188,28,1,0,0,5,30,14,1,0,0,0,2,1,2,1,0,1,0,0,0,0,0]},{\"GameId\":29,\"Score\":[11,74,41,4,2,0,28,61,163,31,0,0,22,83,61,65,3,0,2,5,17,2,1,1,0,0,0,0,0,0,0,0,0,0,1,0]},{\"GameId\":30,\"Score\":[12,65,13,1,2,0,64,54,89,15,0,0,65,149,38,32,0,0,14,36,18,5,1,0,0,2,1,1,0,0,0,0,0,0,0,0]},{\"GameId\":31,\"Score\":[0,0,0,0,0,0,0,0,0,0,0,0,0,0,0,0,0,0,0,0,0,0,0,0,0,0,0,0,0,0,0,0,0,0,0,0]},{\"GameId\":32,\"Score\":[10,64,39,11,0,0,78,36,143,20,2,0,35,120,16,23,2,1,5,24,19,3,0,0,0,1,1,1,1,2,0,0,0,0,0,0]}] ",null,"[{\"GameId\":1,\"Score\":[47,50,19,1,0,0,329,145,52,3,0,2,140,172,13,3,0,1,11,11,4,1,1,1,1,3,2,0,0,0,3,0,0,0,0,0]},{\"GameId\":2,\"Score\":[22,53,50,4,0,0,124,186,95,8,0,0,93,195,49,8,0,0,10,37,15,3,1,0,0,0,0,0,0,0,1,0,0,0,1,2]},{\"GameId\":3,\"Score\":[72,179,182,27,4,1,55,111,106,51,1,0,15,31,29,4,0,0,5,7,3,0,1,1,1,1,0,1,0,1,0,1,0,0,0,0]},{\"GameId\":4,\"Score\":[81,109,94,14,0,0,76,246,114,33,0,0,15,45,40,7,0,0,1,9,2,0,0,0,0,1,2,0,1,0,0,0,0,0,0,1]},{\"GameId\":5,\"Score\":[58,127,179,65,5,2,60,116,115,59,7,0,22,28,22,8,0,1,1,4,2,0,0,0,1,1,1,1,0,0,1,3,0,0,1,1]},{\"GameId\":6,\"Score\":[77,73,36,2,0,0,107,229,81,18,1,1,47,103,64,6,0,0,15,21,3,0,0,0,1,0,3,0,0,0,0,0,1,0,0,2]},{\"GameId\":7,\"Score\":[9,4,3,1,0,1,58,30,7,0,0,0,286,138,16,4,0,0,119,175,15,1,1,0,18,19,2,0,1,0,3,1,1,0,0,0]},{\"GameId\":8,\"Score\":[15,14,2,0,0,0,71,103,27,7,0,0,103,288,89,9,0,0,13,101,52,7,1,0,2,5,4,0,0,1,0,0,0,0,0,0]},{\"GameId\":9,\"Score\":[28,180,179,40,2,4,35,93,175,55,7,1,5,27,26,8,3,0,0,2,1,0,0,0,0,0,0,0,0,1,0,1,0,0,0,0]},{\"GameId\":10,\"Score\":[13,50,24,1,2,0,25,191,160,27,1,0,10,56,216,51,5,0,0,10,19,6,1,0,0,0,1,1,1,1,0,1,1,0,0,0]},{\"GameId\":11,\"Score\":[28,74,73,13,0,0,31,164,197,73,4,1,11,55,80,36,8,1,0,8,8,4,1,0,1,1,2,0,0,0,0,0,0,0,0,0]},{\"GameId\":12,\"Score\":[8,89,250,150,34,3,5,56,105,103,30,2,4,7,6,10,4,0,0,3,2,0,1,0,0,0,0,1,0,0,0,1,0,0,0,1]},{\"GameId\":13,\"Score\":[46,22,1,0,0,0,117,102,23,2,0,0,150,245,37,4,0,0,22,84,30,0,2,0,2,7,2,1,0,1,0,0,0,0,0,0]},{\"GameId\":14,\"Score\":[89,194,105,12,1,0,77,179,115,22,1,0,17,40,28,5,0,0,2,1,3,1,0,0,1,0,1,0,0,0,0,0,0,1,0,0]},{\"GameId\":15,\"Score\":[52,40,8,0,0,0,170,211,38,3,0,1,64,178,41,6,0,1,13,26,6,0,0,0,0,2,0,0,0,1,0,0,0,0,0,0]},{\"GameId\":16,\"Score\":[0,3,0,0,0,0,75,13,5,1,0,0,276,55,4,2,0,0,228,100,2,0,0,0,54,30,1,0,0,1,7,1,0,0,0,0]},{\"GameId\":17,\"Score\":[16,102,181,63,17,2,7,75,215,114,14,1,1,5,20,18,1,0,0,0,2,0,0,0,0,0,0,0,0,0,0,0,0,2,0,0]},{\"GameId\":18,\"Score\":[37,24,1,0,0,0,229,102,17,1,0,0,196,139,28,1,0,0,36,29,11,0,0,0,2,1,0,1,0,0,0,1,1,0,0,0]},{\"GameId\":19,\"Score\":[38,22,10,0,0,0,132,151,44,3,2,0,134,257,45,1,2,0,5,30,9,2,1,0,0,2,2,0,0,0,1,0,0,0,0,1]},{\"GameId\":20,\"Score\":[58,128,83,11,0,0,88,241,120,24,2,0,31,61,26,7,0,0,2,4,3,0,0,0,0,1,0,0,0,0,0,0,1,0,0,1]},{\"GameId\":21,\"Score\":[24,196,205,47,1,0,8,101,154,79,4,0,5,10,15,11,0,0,1,1,0,0,0,0,0,0,0,0,0,0,0,0,1,1,0,0]},{\"GameId\":22,\"Score\":[25,141,109,15,0,0,34,167,172,47,1,0,14,54,57,13,4,0,2,2,2,1,0,0,0,1,1,0,0,0,0,0,0,0,1,0]},{\"GameId\":23,\"Score\":[33,145,88,13,1,1,20,215,196,64,3,0,4,13,44,20,2,0,0,1,1,0,0,0,0,1,0,0,0,0,0,0,0,0,0,0]},{\"GameId\":24,\"Score\":[25,15,9,1,0,0,181,100,29,3,0,0,193,140,37,2,0,0,50,56,9,0,0,0,2,5,1,2,0,0,0,2,0,0,0,0]},{\"GameId\":25,\"Score\":[5,57,143,26,0,0,7,28,191,113,9,2,5,21,24,25,2,0,0,1,5,0,0,0,0,1,0,0,0,0,0,0,0,0,0,0]},{\"GameId\":26,\"Score\":[2,4,0,0,0,0,34,9,5,1,0,0,218,91,6,0,0,0,93,143,17,1,0,0,15,18,2,0,0,0,4,0,0,0,0,0]},{\"GameId\":27,\"Score\":[15,13,0,1,1,0,65,50,24,2,0,0,112,155,21,10,0,0,35,109,28,1,0,1,4,8,6,0,0,0,0,0,2,0,1,0]},{\"GameId\":28,\"Score\":[27,24,9,0,0,0,133,95,39,5,0,0,72,179,27,1,0,0,4,28,14,1,0,0,0,2,1,1,1,0,1,0,0,0,0,0]},{\"GameId\":29,\"Score\":[11,70,40,4,2,0,25,59,157,30,0,0,22,80,57,65,3,0,2,5,16,2,1,1,0,0,0,0,0,0,0,0,0,0,1,0]},{\"GameId\":30,\"Score\":[12,62,13,1,2,0,59,53,86,14,0,0,62,145,38,27,0,0,14,36,18,5,1,0,0,2,1,1,0,0,0,0,0,0,0,0]},{\"GameId\":31,\"Score\":[0,0,0,0,0,0,0,0,0,0,0,0,0,0,0,0,0,0,0,0,0,0,0,0,0,0,0,0,0,0,0,0,0,0,0,0]},{\"GameId\":32,\"Score\":[10,64,39,11,0,0,75,31,135,19,2,0,33,118,16,22,1,1,5,22,19,3,0,0,0,1,1,1,1,2,0,0,0,0,0,0]}] ","[{\"GameId\":1,\"Score\":[47,51,19,1,0,0,328,142,52,3,0,2,141,171,13,3,0,1,11,10,4,1,1,1,1,3,2,0,0,0,3,0,0,0,0,0]},{\"GameId\":2,\"Score\":[22,53,50,4,0,0,124,187,95,8,0,0,92,195,48,8,0,0,10,37,15,3,1,0,0,0,0,0,0,0,1,0,0,0,1,2]},{\"GameId\":3,\"Score\":[71,179,182,28,4,1,55,110,106,51,1,0,15,31,29,4,0,0,5,7,3,0,1,1,1,1,0,1,0,1,0,1,0,0,0,0]},{\"GameId\":4,\"Score\":[81,109,93,14,0,0,77,245,114,33,0,0,15,45,40,7,0,0,1,9,2,0,0,0,0,1,2,0,1,0,0,0,0,0,0,1]},{\"GameId\":5,\"Score\":[58,127,179,64,5,2,60,116,115,59,7,0,22,28,22,8,0,1,1,4,2,0,0,0,1,1,1,1,0,0,1,3,0,0,1,1]},{\"GameId\":6,\"Score\":[78,73,36,2,0,0,106,229,80,18,1,1,47,103,64,6,0,0,15,21,3,0,0,0,1,0,3,0,0,0,0,0,1,0,0,2]},{\"GameId\":7,\"Score\":[9,4,3,1,0,1,58,29,7,0,0,0,287,139,16,4,0,0,119,174,14,1,1,0,18,19,2,0,1,0,3,1,1,0,0,0]},{\"GameId\":8,\"Score\":[15,14,2,0,0,0,71,102,26,7,0,0,103,288,89,9,0,0,13,102,52,7,1,0,2,5,4,0,0,1,0,0,0,0,0,0]},{\"GameId\":9,\"Score\":[29,180,178,40,2,4,35,93,175,55,7,1,5,26,26,8,3,0,0,2,1,0,0,0,0,0,0,0,0,1,0,1,0,0,0,0]},{\"GameId\":10,\"Score\":[13,50,24,1,2,0,25,191,160,27,1,0,10,56,217,51,4,0,0,10,18,6,1,0,0,0,1,1,1,1,0,1,1,0,0,0]},{\"GameId\":11,\"Score\":[28,74,72,13,0,0,31,164,197,73,4,1,11,55,81,35,8,1,0,8,8,4,1,0,1,1,2,0,0,0,0,0,0,0,0,0]},{\"GameId\":12,\"Score\":[8,88,250,151,34,3,5,56,104,103,30,2,4,7,6,10,4,0,0,3,2,0,1,0,0,0,0,1,0,0,0,1,0,0,0,1]},{\"GameId\":13,\"Score\":[46,22,1,0,0,0,118,100,23,2,0,0,150,245,37,4,0,0,22,84,30,0,2,0,2,7,2,1,0,1,0,0,0,0,0,0]},{\"GameId\":14,\"Score\":[89,193,105,13,1,0,78,178,115,22,1,0,17,39,28,5,0,0,2,1,3,1,0,0,1,0,1,0,0,0,0,0,0,1,0,0]},{\"GameId\":15,\"Score\":[52,40,8,0,0,0,170,210,37,3,0,1,64,179,41,6,0,1,13,26,6,0,0,0,0,2,0,0,0,1,0,0,0,0,0,0]},{\"GameId\":16,\"Score\":[0,3,0,0,0,0,75,13,5,1,0,0,276,55,4,2,0,0,227,100,2,0,0,0,54,30,1,0,0,1,7,1,0,0,0,0]},{\"GameId\":17,\"Score\":[16,102,181,63,17,2,7,75,215,114,14,1,1,5,19,18,1,0,0,0,2,0,0,0,0,0,0,0,0,0,0,0,0,2,0,0]},{\"GameId\":18,\"Score\":[37,24,1,0,0,0,230,101,17,1,0,0,195,139,28,1,0,0,36,29,11,0,0,0,2,1,0,1,0,0,0,1,1,0,0,0]},{\"GameId\":19,\"Score\":[38,22,11,0,0,0,132,151,43,3,2,0,134,258,45,1,2,0,4,30,8,2,1,0,0,2,2,0,0,0,1,0,0,0,0,1]},{\"GameId\":20,\"Score\":[58,128,82,11,0,0,89,239,120,24,2,0,31,61,27,7,0,0,2,4,3,0,0,0,0,1,0,0,0,0,0,0,1,0,0,1]},{\"GameId\":21,\"Score\":[24,197,204,47,1,0,8,101,153,79,4,0,5,10,15,11,0,0,1,1,0,0,0,0,0,0,0,0,0,0,0,0,1,1,0,0]},{\"GameId\":22,\"Score\":[25,141,110,15,0,0,34,167,172,47,1,0,14,53,56,13,4,0,2,2,2,1,0,0,0,1,1,0,0,0,0,0,0,0,1,0]},{\"GameId\":23,\"Score\":[33,145,89,13,1,1,20,215,194,64,3,0,4,13,44,20,2,0,0,1,1,0,0,0,0,1,0,0,0,0,0,0,0,0,0,0]},{\"GameId\":24,\"Score\":[25,15,9,1,0,0,181,99,29,3,0,0,193,140,37,2,0,0,51,56,9,0,0,0,2,4,1,2,0,0,0,2,0,0,0,0]},{\"GameId\":25,\"Score\":[5,57,143,26,0,0,7,28,191,112,9,2,5,21,24,25,2,0,0,1,5,0,0,0,0,1,0,0,0,0,0,0,0,0,0,0]},{\"GameId\":26,\"Score\":[2,4,0,0,0,0,34,9,5,1,0,0,218,91,6,0,0,0,93,142,17,1,0,0,15,18,2,0,0,0,4,0,0,0,0,0]},{\"GameId\":27,\"Score\":[15,13,0,1,1,0,65,49,24,2,0,0,112,155,21,10,0,0,35,109,28,1,0,1,4,8,6,0,0,0,0,0,2,0,1,0]},{\"GameId\":28,\"Score\":[27,24,9,0,0,0,133,95,39,5,0,0,72,179,27,1,0,0,4,27,14,1,0,0,0,2,1,1,1,0,1,0,0,0,0,0]},{\"GameId\":29,\"Score\":[11,70,40,4,2,0,25,59,156,30,0,0,22,80,57,65,3,0,2,5,16,2,1,1,0,0,0,0,0,0,0,0,0,0,1,0]},{\"GameId\":30,\"Score\":[12,62,13,1,2,0,59,53,86,14,0,0,62,145,38,27,0,0,14,36,18,5,0,0,0,2,1,1,0,0,0,0,0,0,0,0]},{\"GameId\":31,\"Score\":[0,0,0,0,0,0,0,0,0,0,0,0,0,0,0,0,0,0,0,0,0,0,0,0,0,0,0,0,0,0,0,0,0,0,0,0]},{\"GameId\":32,\"Score\":[10,64,39,11,0,0,75,31,135,19,2,0,33,118,16,21,1,1,5,22,19,3,0,0,0,1,1,1,1,2,0,0,0,0,0,0]}] ","[{\"GameId\":1,\"Score\":[1,2,0,0,0,0,4,1,1,1,0,0,1,1,0,0,0,0,0,0,0,0,0,0,0,1,0,0,0,0,0,0,0,0,0,0]},{\"GameId\":2,\"Score\":[2,0,2,0,0,0,1,2,0,0,0,0,1,2,1,0,0,0,0,0,0,0,0,0,0,0,0,0,0,0,0,0,0,0,0,0]},{\"GameId\":3,\"Score\":[2,2,2,0,0,0,0,2,0,0,0,0,0,0,1,0,0,0,0,0,0,0,0,0,0,0,0,0,0,0,0,0,0,0,0,0]},{\"GameId\":4,\"Score\":[0,1,0,0,0,0,0,5,1,1,0,0,0,0,0,1,0,0,0,0,0,0,0,0,0,0,0,0,0,0,0,0,0,0,0,0]},{\"GameId\":5,\"Score\":[1,1,2,0,0,0,2,2,0,1,0,0,0,0,0,0,0,0,0,0,0,0,0,0,0,0,0,0,0,0,0,0,0,0,0,0]},{\"GameId\":6,\"Score\":[1,2,0,0,0,0,1,1,1,0,0,0,1,0,2,0,0,0,0,0,0,0,0,0,0,0,0,0,0,0,0,0,0,0,0,0]},{\"GameId\":7,\"Score\":[1,0,0,0,0,0,0,1,0,0,0,0,2,5,0,0,0,0,0,2,0,0,0,0,0,0,0,0,0,0,0,0,0,0,0,0]},{\"GameId\":8,\"Score\":[1,0,0,0,0,0,0,1,1,0,0,0,1,2,3,0,0,0,0,2,0,0,0,0,0,0,0,0,0,0,0,0,0,0,0,0]},{\"GameId\":9,\"Score\":[1,2,2,1,0,0,0,0,1,1,0,0,1,0,0,0,0,0,0,0,0,0,0,0,0,0,0,0,0,0,0,0,0,0,0,0]},{\"GameId\":10,\"Score\":[2,0,1,0,0,0,0,1,4,0,0,0,0,0,1,0,0,0,0,0,0,0,0,0,0,0,0,0,0,0,0,0,0,0,0,0]},{\"GameId\":11,\"Score\":[1,0,0,0,0,0,0,4,0,0,0,0,1,0,3,0,0,0,0,0,0,0,0,0,0,0,0,0,0,0,0,0,0,0,0,0]},{\"GameId\":12,\"Score\":[1,0,2,1,0,0,0,1,1,2,0,0,0,0,0,1,0,0,0,0,0,0,0,0,0,0,0,0,0,0,0,0,0,0,0,0]},{\"GameId\":13,\"Score\":[1,0,0,0,0,0,2,2,0,0,0,0,0,6,0,0,0,0,0,1,1,0,0,0,0,0,0,0,0,0,0,0,0,0,0,0]},{\"GameId\":14,\"Score\":[4,2,0,0,0,0,2,2,1,0,0,0,0,0,0,0,0,0,0,0,0,0,0,0,0,0,0,0,0,0,0,0,0,0,0,0]},{\"GameId\":15,\"Score\":[0,1,0,0,0,0,1,1,0,0,0,0,1,2,2,0,0,0,0,0,0,0,0,0,0,1,0,0,0,0,0,0,0,0,0,0]},{\"GameId\":16,\"Score\":[0,0,0,0,0,0,1,0,0,0,0,0,4,0,0,0,0,0,2,0,0,0,0,0,1,0,0,0,0,0,0,0,0,0,0,0]},{\"GameId\":17,\"Score\":[0,2,2,0,0,0,0,2,0,2,0,0,0,0,0,0,0,0,0,0,0,0,0,0,0,0,0,0,0,0,0,0,0,0,0,0]},{\"GameId\":18,\"Score\":[0,0,0,0,0,0,5,1,0,0,0,0,1,1,0,0,0,0,0,0,0,0,0,0,0,0,0,0,0,0,0,0,0,0,0,0]},{\"GameId\":19,\"Score\":[2,0,0,0,0,0,3,1,1,0,0,0,1,0,2,0,0,0,0,0,0,0,0,0,0,0,0,0,0,0,0,0,0,0,0,0]},{\"GameId\":20,\"Score\":[1,2,1,0,0,0,1,1,1,1,0,0,2,0,0,0,0,0,0,0,0,0,0,0,0,0,0,0,0,0,0,0,0,0,0,0]},{\"GameId\":21,\"Score\":[0,3,2,1,0,0,0,3,0,0,0,0,0,0,0,0,0,0,0,0,0,0,0,0,0,0,0,0,0,0,0,0,0,0,0,0]},{\"GameId\":22,\"Score\":[0,2,0,0,0,0,0,2,2,0,0,0,0,1,1,0,0,0,0,0,0,0,0,0,0,0,0,0,0,0,0,0,0,0,0,0]},{\"GameId\":23,\"Score\":[0,1,0,0,1,0,0,4,2,1,0,0,0,0,0,0,0,0,0,0,0,0,0,0,0,0,0,0,0,0,0,0,0,0,0,0]},{\"GameId\":24,\"Score\":[0,0,0,0,0,0,4,1,0,0,0,0,1,2,0,0,0,0,0,0,0,0,0,0,0,0,0,0,0,0,0,0,0,0,0,0]},{\"GameId\":25,\"Score\":[0,3,0,0,0,0,0,0,2,1,1,0,0,0,0,0,0,0,0,0,0,0,0,0,0,0,0,0,0,0,0,0,0,0,0,0]},{\"GameId\":26,\"Score\":[0,0,0,0,0,0,0,0,0,0,0,0,2,1,0,0,0,0,2,2,0,0,0,0,0,0,0,0,0,0,0,0,0,0,0,0]},{\"GameId\":27,\"Score\":[0,0,0,0,0,0,0,0,0,0,0,0,3,1,0,0,0,0,0,3,0,0,0,0,0,0,0,0,0,0,0,0,0,0,0,0]},{\"GameId\":28,\"Score\":[0,0,0,0,0,0,0,3,1,1,0,0,0,2,0,0,0,0,0,0,0,0,0,0,0,0,0,0,0,0,0,0,0,0,0,0]},{\"GameId\":29,\"Score\":[0,0,0,0,0,0,1,1,1,1,0,0,0,0,1,2,0,0,0,0,0,0,0,0,0,0,0,0,0,0,0,0,0,0,0,0]},{\"GameId\":30,\"Score\":[0,0,0,0,0,0,2,0,0,0,0,0,2,2,0,0,0,0,0,0,0,0,0,0,0,0,0,1,0,0,0,0,0,0,0,0]},{\"GameId\":31,\"Score\":[0,0,0,0,0,0,0,0,0,0,0,0,0,0,0,0,0,0,0,0,0,0,0,0,0,0,0,0,0,0,0,0,0,0,0,0]},{\"GameId\":32,\"Score\":[1,0,0,0,0,0,0,0,2,1,0,0,1,1,0,0,0,0,0,1,0,0,0,0,0,0,0,0,0,0,0,0,0,0,0,0]}] ","[{\"GameId\":1,\"Score\":[1,1,0,0,0,0,1,2,0,0,0,0,1,0,0,0,0,0,0,0,0,0,0,0,0,0,0,0,0,0,0,0,0,0,0,0]},{\"GameId\":2,\"Score\":[0,0,1,0,0,0,1,1,0,0,0,0,1,2,0,0,0,0,0,0,0,0,0,0,0,0,0,0,0,0,0,0,0,0,0,0]},{\"GameId\":3,\"Score\":[0,2,1,0,0,0,0,2,0,0,0,0,0,0,0,0,0,0,0,0,0,0,0,0,0,0,0,0,0,0,0,0,0,0,0,0]},{\"GameId\":4,\"Score\":[0,1,0,0,0,0,0,3,0,0,0,0,0,0,0,1,0,0,0,0,0,0,0,0,0,0,0,0,0,0,0,0,0,0,0,0]},{\"GameId\":5,\"Score\":[0,0,2,0,0,0,2,1,0,0,0,0,0,0,0,0,0,0,0,0,0,0,0,0,0,0,0,0,0,0,0,0,0,0,0,0]},{\"GameId\":6,\"Score\":[0,1,0,0,0,0,1,0,1,0,0,0,0,0,2,0,0,0,0,0,0,0,0,0,0,0,0,0,0,0,0,0,0,0,0,0]},{\"GameId\":7,\"Score\":[1,0,0,0,0,0,0,1,0,0,0,0,2,2,0,0,0,0,0,0,0,0,0,0,0,0,0,0,0,0,0,0,0,0,0,0]},{\"GameId\":8,\"Score\":[1,0,0,0,0,0,0,0,1,0,0,0,0,1,1,0,0,0,0,2,0,0,0,0,0,0,0,0,0,0,0,0,0,0,0,0]},{\"GameId\":9,\"Score\":[1,1,2,0,0,0,0,0,0,0,0,0,1,0,0,0,0,0,0,0,0,0,0,0,0,0,0,0,0,0,0,0,0,0,0,0]},{\"GameId\":10,\"Score\":[1,0,0,0,0,0,0,1,3,0,0,0,0,0,0,0,0,0,0,0,0,0,0,0,0,0,0,0,0,0,0,0,0,0,0,0]},{\"GameId\":11,\"Score\":[1,0,0,0,0,0,0,3,0,0,0,0,0,0,1,0,0,0,0,0,0,0,0,0,0,0,0,0,0,0,0,0,0,0,0,0]},{\"GameId\":12,\"Score\":[1,0,1,1,0,0,0,1,1,0,0,0,0,0,0,0,0,0,0,0,0,0,0,0,0,0,0,0,0,0,0,0,0,0,0,0]},{\"GameId\":13,\"Score\":[1,0,0,0,0,0,1,1,0,0,0,0,0,4,0,0,0,0,0,1,0,0,0,0,0,0,0,0,0,0,0,0,0,0,0,0]},{\"GameId\":14,\"Score\":[2,2,0,0,0,0,1,1,0,0,0,0,0,0,0,0,0,0,0,0,0,0,0,0,0,0,0,0,0,0,0,0,0,0,0,0]},{\"GameId\":15,\"Score\":[0,1,0,0,0,0,1,0,0,0,0,0,0,2,0,0,0,0,0,0,0,0,0,0,0,1,0,0,0,0,0,0,0,0,0,0]},{\"GameId\":16,\"Score\":[0,0,0,0,0,0,0,0,0,0,0,0,3,0,0,0,0,0,1,0,0,0,0,0,0,0,0,0,0,0,0,0,0,0,0,0]},{\"GameId\":17,\"Score\":[0,1,1,0,0,0,0,1,0,1,0,0,0,0,0,0,0,0,0,0,0,0,0,0,0,0,0,0,0,0,0,0,0,0,0,0]},{\"GameId\":18,\"Score\":[0,0,0,0,0,0,2,1,0,0,0,0,1,0,0,0,0,0,0,0,0,0,0,0,0,0,0,0,0,0,0,0,0,0,0,0]},{\"GameId\":19,\"Score\":[1,0,0,0,0,0,2,1,1,0,0,0,0,0,0,0,0,0,0,0,0,0,0,0,0,0,0,0,0,0,0,0,0,0,0,0]},{\"GameId\":20,\"Score\":[0,1,1,0,0,0,1,1,0,0,0,0,1,0,0,0,0,0,0,0,0,0,0,0,0,0,0,0,0,0,0,0,0,0,0,0]},{\"GameId\":21,\"Score\":[0,2,1,1,0,0,0,1,0,0,0,0,0,0,0,0,0,0,0,0,0,0,0,0,0,0,0,0,0,0,0,0,0,0,0,0]},{\"GameId\":22,\"Score\":[0,1,0,0,0,0,0,1,2,0,0,0,0,0,0,0,0,0,0,0,0,0,0,0,0,0,0,0,0,0,0,0,0,0,0,0]},{\"GameId\":23,\"Score\":[0,0,0,0,1,0,0,3,1,0,0,0,0,0,0,0,0,0,0,0,0,0,0,0,0,0,0,0,0,0,0,0,0,0,0,0]},{\"GameId\":24,\"Score\":[0,0,0,0,0,0,2,1,0,0,0,0,1,1,0,0,0,0,0,0,0,0,0,0,0,0,0,0,0,0,0,0,0,0,0,0]},{\"GameId\":25,\"Score\":[0,1,0,0,0,0,0,0,1,1,0,0,0,0,0,0,0,0,0,0,0,0,0,0,0,0,0,0,0,0,0,0,0,0,0,0]},{\"GameId\":26,\"Score\":[0,0,0,0,0,0,0,0,0,0,0,0,0,1,0,0,0,0,1,1,0,0,0,0,0,0,0,0,0,0,0,0,0,0,0,0]},{\"GameId\":27,\"Score\":[0,0,0,0,0,0,0,0,0,0,0,0,2,0,0,0,0,0,0,1,0,0,0,0,0,0,0,0,0,0,0,0,0,0,0,0]},{\"GameId\":28,\"Score\":[0,0,0,0,0,0,0,1,1,0,0,0,0,1,0,0,0,0,0,0,0,0,0,0,0,0,0,0,0,0,0,0,0,0,0,0]},{\"GameId\":29,\"Score\":[0,0,0,0,0,0,1,0,1,0,0,0,0,0,0,1,0,0,0,0,0,0,0,0,0,0,0,0,0,0,0,0,0,0,0,0]},{\"GameId\":30,\"Score\":[0,0,0,0,0,0,1,0,0,0,0,0,1,1,0,0,0,0,0,0,0,0,0,0,0,0,0,0,0,0,0,0,0,0,0,0]},{\"GameId\":31,\"Score\":[0,0,0,0,0,0,0,0,0,0,0,0,0,0,0,0,0,0,0,0,0,0,0,0,0,0,0,0,0,0,0,0,0,0,0,0]},{\"GameId\":32,\"Score\":[1,0,0,0,0,0,0,0,2,1,0,0,0,0,0,0,0,0,0,0,0,0,0,0,0,0,0,0,0,0,0,0,0,0,0,0]}] "]
[null,"{\"success\":6,\"rank\":367,\"total\":2757} ","{\"success\":6,\"rank\":253,\"total\":2685} ","{\"success\":0,\"rank\":2338,\"total\":2338} ","{\"success\":0,\"rank\":2058,\"total\":2058} ","{\"success\":0,\"rank\":2018,\"total\":2018} ","{\"success\":0,\"rank\":2006,\"total\":2006} ","{\"success\":0,\"rank\":1966,\"total\":1966} ","{\"success\":0,\"rank\":1935,\"total\":1935} ",null,"{\"success\":0,\"rank\":1932,\"total\":1932} ","{\"success\":0,\"rank\":1932,\"total\":1932} ",null,null,null,"{\"success\":0,\"rank\":3,\"total\":3} "]